BDBM50348035 CHEMBL1800481
SMILES: CN(C)c1cccc(NCCC2(CCOC(C)(C)C2)c2ccccc2)c1
InChI Key: InChIKey=MBZHPWOXFNSVKA-UHFFFAOYSA-N
Data: 1 IC50
Activity Spreadsheet -- Enzyme Inhibition Constant Data from BindingDB
Found 1 hit for monomerid = 50348035
Trg + Lig
Ki
nM
ΔG°
kcal/mole
IC50
nM
Kd
nM
EC50/IC50
nM
koff
s-1
kon
M-1s-1
pHTemp
°C
Isoprenylcysteine carboxyl methyltransferase
(Homo sapiens (Human))
BDBM50348035
(CHEMBL1800481)
Show SMILES CN(C)c1cccc(NCCC2(CCOC(C)(C)C2)c2ccccc2)c1
Show InChI InChI=1S/C23H32N2O/c1-22(2)18-23(14-16-26-22,19-9-6-5-7-10-19)13-15-24-20-11-8-12-21(17-20)25(3)4/h5-12,17,24H,13-16,18H2,1-4H3
n/an/a 131n/an/an/an/an/an/a
Myrexis, Inc.
Curated by ChEMBL
Assay Description
Inhibition of human recombinant C-terminal His6-tagged ICMT assessed as methylation of N-acetyl-S-geranylgeranylcysteine using SAM as methyl donor su...
J Med Chem 54: 5031-47 (2011)
Article DOI: 10.1021/jm200249a
BindingDB Entry DOI: 10.7270/Q2XW4K49