BDBM50348049 CHEMBL1800496
SMILES: COc1c(F)cc(NCCC2(CCOC(C)(C)C2)c2ccccc2)cc1F
InChI Key: InChIKey=MLSLMDSHOYGVCD-UHFFFAOYSA-N
Data: 1 IC50
Activity Spreadsheet -- Enzyme Inhibition Constant Data from BindingDB
Found 1 hit for monomerid = 50348049
Trg + Lig
Ki
nM
ΔG°
kcal/mole
IC50
nM
Kd
nM
EC50/IC50
nM
koff
s-1
kon
M-1s-1
pHTemp
°C
Isoprenylcysteine carboxyl methyltransferase
(Homo sapiens (Human))
BDBM50348049
(CHEMBL1800496)
Show SMILES COc1c(F)cc(NCCC2(CCOC(C)(C)C2)c2ccccc2)cc1F
Show InChI InChI=1S/C22H27F2NO2/c1-21(2)15-22(10-12-27-21,16-7-5-4-6-8-16)9-11-25-17-13-18(23)20(26-3)19(24)14-17/h4-8,13-14,25H,9-12,15H2,1-3H3
n/an/a 31n/an/an/an/an/an/a
Myrexis, Inc.
Curated by ChEMBL
Assay Description
Inhibition of human recombinant C-terminal His6-tagged ICMT assessed as methylation of N-acetyl-S-geranylgeranylcysteine using SAM as methyl donor su...
J Med Chem 54: 5031-47 (2011)
Article DOI: 10.1021/jm200249a
BindingDB Entry DOI: 10.7270/Q2XW4K49