BDBM50348054 CHEMBL1800501
SMILES: CC1(C)CC(CCNc2cccc(c2)[N+]([O-])=O)(CCO1)c1ccccc1
InChI Key: InChIKey=XBQZRCWMRJRSES-UHFFFAOYSA-N
Data: 1 IC50
Activity Spreadsheet -- Enzyme Inhibition Constant Data from BindingDB
Found 1 hit for monomerid = 50348054
Trg + Lig
Ki
nM
ΔG°
kcal/mole
IC50
nM
Kd
nM
EC50/IC50
nM
koff
s-1
kon
M-1s-1
pHTemp
°C
Isoprenylcysteine carboxyl methyltransferase
(Homo sapiens (Human))
BDBM50348054
(CHEMBL1800501)
Show SMILES CC1(C)CC(CCNc2cccc(c2)[N+]([O-])=O)(CCO1)c1ccccc1
Show InChI InChI=1S/C21H26N2O3/c1-20(2)16-21(12-14-26-20,17-7-4-3-5-8-17)11-13-22-18-9-6-10-19(15-18)23(24)25/h3-10,15,22H,11-14,16H2,1-2H3
n/an/a 26n/an/an/an/an/an/a
Myrexis, Inc.
Curated by ChEMBL
Assay Description
Inhibition of human recombinant C-terminal His6-tagged ICMT assessed as methylation of N-acetyl-S-geranylgeranylcysteine using SAM as methyl donor su...
J Med Chem 54: 5031-47 (2011)
Article DOI: 10.1021/jm200249a
BindingDB Entry DOI: 10.7270/Q2XW4K49