BDBM50348064 CHEMBL1800512
SMILES: COc1cccc(NCCC2(CCOC(C)(C)C2)c2ccc(F)cc2)c1
InChI Key: InChIKey=FSVYPXSGQVKMGG-UHFFFAOYSA-N
Data: 1 IC50
Activity Spreadsheet -- Enzyme Inhibition Constant Data from BindingDB
Found 1 hit for monomerid = 50348064
Trg + Lig
Ki
nM
ΔG°
kcal/mole
IC50
nM
Kd
nM
EC50/IC50
nM
koff
s-1
kon
M-1s-1
pHTemp
°C
Isoprenylcysteine carboxyl methyltransferase
(Homo sapiens (Human))
BDBM50348064
(CHEMBL1800512)
Show SMILES COc1cccc(NCCC2(CCOC(C)(C)C2)c2ccc(F)cc2)c1
Show InChI InChI=1S/C22H28FNO2/c1-21(2)16-22(12-14-26-21,17-7-9-18(23)10-8-17)11-13-24-19-5-4-6-20(15-19)25-3/h4-10,15,24H,11-14,16H2,1-3H3
n/an/a 100n/an/an/an/an/an/a
Myrexis, Inc.
Curated by ChEMBL
Assay Description
Inhibition of human recombinant C-terminal His6-tagged ICMT assessed as methylation of N-acetyl-S-geranylgeranylcysteine using SAM as methyl donor su...
J Med Chem 54: 5031-47 (2011)
Article DOI: 10.1021/jm200249a
BindingDB Entry DOI: 10.7270/Q2XW4K49