BDBM50348129 CHEMBL1800176
SMILES: CCS(=O)(=O)c1ccc2n(CC3CC3)c(CCC(C)C)nc2c1
InChI Key: InChIKey=IYOZCAVJZKOVCR-UHFFFAOYSA-N
Data: 1 EC50
Activity Spreadsheet -- Enzyme Inhibition Constant Data from BindingDB
Found 1 hit for monomerid = 50348129
Trg + Lig
Ki
nM
ΔG°
kcal/mole
IC50
nM
Kd
nM
EC50/IC50
nM
koff
s-1
kon
M-1s-1
pHTemp
°C
Cannabinoid receptor 2
(Homo sapiens (Human))
BDBM50348129
(CHEMBL1800176)
Show SMILES CCS(=O)(=O)c1ccc2n(CC3CC3)c(CCC(C)C)nc2c1
Show InChI InChI=1S/C18H26N2O2S/c1-4-23(21,22)15-8-9-17-16(11-15)19-18(10-5-13(2)3)20(17)12-14-6-7-14/h8-9,11,13-14H,4-7,10,12H2,1-3H3
Reactome pathway
n/an/an/an/a 67n/an/an/an/a
Pfizer Inc.
Curated by ChEMBL
Assay Description
Agonist activity at human recombinant CB2 receptor expressed in CHO cells assessed as inhibition forskolin-induced cAMP release
Bioorg Med Chem Lett 21: 4284-7 (2011)
Article DOI: 10.1016/j.bmcl.2011.05.063
BindingDB Entry DOI: 10.7270/Q2959HXV