BDBM50348133 CHEMBL1800180
SMILES: CCS(=O)(=O)c1ccc2n(CCN(C)C)c(nc2c1)C(C)(C)C
InChI Key: InChIKey=QLPOXKKPNVNGJJ-UHFFFAOYSA-N
Data: 1 EC50
Activity Spreadsheet -- Enzyme Inhibition Constant Data from BindingDB
Found 1 hit for monomerid = 50348133
Trg + Lig
Ki
nM
ΔG°
kcal/mole
IC50
nM
Kd
nM
EC50/IC50
nM
koff
s-1
kon
M-1s-1
pHTemp
°C
Cannabinoid receptor 2
(Homo sapiens (Human))
BDBM50348133
(CHEMBL1800180)
Show SMILES CCS(=O)(=O)c1ccc2n(CCN(C)C)c(nc2c1)C(C)(C)C
Show InChI InChI=1S/C17H27N3O2S/c1-7-23(21,22)13-8-9-15-14(12-13)18-16(17(2,3)4)20(15)11-10-19(5)6/h8-9,12H,7,10-11H2,1-6H3
Reactome pathway
n/an/an/an/a 39n/an/an/an/a
Pfizer Inc.
Curated by ChEMBL
Assay Description
Agonist activity at human recombinant CB2 receptor expressed in CHO cells assessed as inhibition forskolin-induced cAMP release
Bioorg Med Chem Lett 21: 4284-7 (2011)
Article DOI: 10.1016/j.bmcl.2011.05.063
BindingDB Entry DOI: 10.7270/Q2959HXV