BDBM50348153 CHEMBL1800782
SMILES: CCC1Cn2c(N1)c1nc(nc1n(CC=C)c2=O)-c1cc(OC)nn1C
InChI Key: InChIKey=ANARBNFHRFJIQR-UHFFFAOYSA-N
Data: 3 KI  2 IC50
Activity Spreadsheet -- Enzyme Inhibition Constant Data from BindingDB
Found 5 hits for monomerid = 50348153
Trg + Lig
Ki
nM
ΔG°
kcal/mole
IC50
nM
Kd
nM
EC50/IC50
nM
koff
s-1
kon
M-1s-1
pHTemp
°C
Adenosine receptor A3
(Homo sapiens (Human))
BDBM50348153
(CHEMBL1800782)
Show SMILES CCC1Cn2c(N1)c1nc(nc1n(CC=C)c2=O)-c1cc(OC)nn1C
Show InChI InChI=1S/C17H21N7O2/c1-5-7-23-16-13(15-18-10(6-2)9-24(15)17(23)25)19-14(20-16)11-8-12(26-4)21-22(11)3/h5,8,10,18H,1,6-7,9H2,2-4H3
Reactome pathway
1.96n/an/an/an/an/an/an/an/a
Universit£ di Ferrara
Curated by ChEMBL
Assay Description
Displacement of [3H]MRE 3008F20 from human adenosine A3 receptor expressed in CHO cells after 120 mins by scintillation spectrometry
J Med Chem 54: 5205-20 (2011)
Article DOI: 10.1021/jm2004738
BindingDB Entry DOI: 10.7270/Q21N81G6
Adenosine receptor A1
(Homo sapiens (Human))
BDBM50348153
(CHEMBL1800782)
Show SMILES CCC1Cn2c(N1)c1nc(nc1n(CC=C)c2=O)-c1cc(OC)nn1C
Show InChI InChI=1S/C17H21N7O2/c1-5-7-23-16-13(15-18-10(6-2)9-24(15)17(23)25)19-14(20-16)11-8-12(26-4)21-22(11)3/h5,8,10,18H,1,6-7,9H2,2-4H3
Reactome pathway
1.53E+3n/an/an/an/an/an/an/an/a
Universit£ di Ferrara
Curated by ChEMBL
Assay Description
Displacement of [3H]DPCPX from human adenosine A1 receptor expressed in CHO cells after 120 mins by scintillation spectrometry
J Med Chem 54: 5205-20 (2011)
Article DOI: 10.1021/jm2004738
BindingDB Entry DOI: 10.7270/Q21N81G6
Adenosine receptor A2a
(Homo sapiens (Human))
BDBM50348153
(CHEMBL1800782)
Show SMILES CCC1Cn2c(N1)c1nc(nc1n(CC=C)c2=O)-c1cc(OC)nn1C
Show InChI InChI=1S/C17H21N7O2/c1-5-7-23-16-13(15-18-10(6-2)9-24(15)17(23)25)19-14(20-16)11-8-12(26-4)21-22(11)3/h5,8,10,18H,1,6-7,9H2,2-4H3
NCI pathway
Reactome pathway
>5.00E+3n/an/an/an/an/an/an/an/a
Universit£ di Ferrara
Curated by ChEMBL
Assay Description
Displacement of [3H]ZM 241385 from human adenosine A2A receptor expressed in CHO cells after 60 mins by scintillation spectrometry
J Med Chem 54: 5205-20 (2011)
Article DOI: 10.1021/jm2004738
BindingDB Entry DOI: 10.7270/Q21N81G6
Adenosine receptor A2b
(Homo sapiens (Human))
BDBM50348153
(CHEMBL1800782)
Show SMILES CCC1Cn2c(N1)c1nc(nc1n(CC=C)c2=O)-c1cc(OC)nn1C
Show InChI InChI=1S/C17H21N7O2/c1-5-7-23-16-13(15-18-10(6-2)9-24(15)17(23)25)19-14(20-16)11-8-12(26-4)21-22(11)3/h5,8,10,18H,1,6-7,9H2,2-4H3
NCI pathway
Reactome pathway
n/an/a>5.00E+3n/an/an/an/an/an/a
Universit£ di Ferrara
Curated by ChEMBL
Assay Description
Antagonist activity human adenosine A2B receptor expressed in CHO cells assessed as inhibition of NECA-mediated [3H]cAMP accumulation after 150 mins ...
J Med Chem 54: 5205-20 (2011)
Article DOI: 10.1021/jm2004738
BindingDB Entry DOI: 10.7270/Q21N81G6
Adenosine receptor A3
(Homo sapiens (Human))
BDBM50348153
(CHEMBL1800782)
Show SMILES CCC1Cn2c(N1)c1nc(nc1n(CC=C)c2=O)-c1cc(OC)nn1C
Show InChI InChI=1S/C17H21N7O2/c1-5-7-23-16-13(15-18-10(6-2)9-24(15)17(23)25)19-14(20-16)11-8-12(26-4)21-22(11)3/h5,8,10,18H,1,6-7,9H2,2-4H3
Reactome pathway
n/an/a 12.2n/an/an/an/an/an/a
Universit£ di Ferrara
Curated by ChEMBL
Assay Description
Antagonist activity human adenosine A3 receptor expressed in CHO cells assessed as blockade of Cl-IB-MECA-mediated inhibition of forskolin-stimulated...
J Med Chem 54: 5205-20 (2011)
Article DOI: 10.1021/jm2004738
BindingDB Entry DOI: 10.7270/Q21N81G6