BDBM50348158 CHEMBL1800787
SMILES: COc1cc(-c2nc3N(Cc4ccccc4)C(=O)N4C[C@H](C)N=C4c3[nH]2)n(C)n1
InChI Key: InChIKey=GUQZGHDGKRREHX-LBPRGKRZSA-N
Data: 3 KI  2 IC50
Activity Spreadsheet -- Enzyme Inhibition Constant Data from BindingDB
Found 5 hits for monomerid = 50348158
Trg + Lig
Ki
nM
ΔG°
kcal/mole
IC50
nM
Kd
nM
EC50/IC50
nM
koff
s-1
kon
M-1s-1
pHTemp
°C
Adenosine receptor A3
(Homo sapiens (Human))
BDBM50348158
(CHEMBL1800787)
Show SMILES COc1cc(-c2nc3N(Cc4ccccc4)C(=O)N4C[C@H](C)N=C4c3[nH]2)n(C)n1 |r,c:23|
Show InChI InChI=1S/C20H21N7O2/c1-12-10-26-18(21-12)16-19(27(20(26)28)11-13-7-5-4-6-8-13)23-17(22-16)14-9-15(29-3)24-25(14)2/h4-9,12H,10-11H2,1-3H3,(H,22,23)/t12-/m0/s1
Reactome pathway
2.52n/an/an/an/an/an/an/an/a
Universit£ di Ferrara
Curated by ChEMBL
Assay Description
Displacement of [3H]MRE 3008F20 from human adenosine A3 receptor expressed in CHO cells after 120 mins by scintillation spectrometry
J Med Chem 54: 5205-20 (2011)
Article DOI: 10.1021/jm2004738
BindingDB Entry DOI: 10.7270/Q21N81G6
Adenosine receptor A1
(Homo sapiens (Human))
BDBM50348158
(CHEMBL1800787)
Show SMILES COc1cc(-c2nc3N(Cc4ccccc4)C(=O)N4C[C@H](C)N=C4c3[nH]2)n(C)n1 |r,c:23|
Show InChI InChI=1S/C20H21N7O2/c1-12-10-26-18(21-12)16-19(27(20(26)28)11-13-7-5-4-6-8-13)23-17(22-16)14-9-15(29-3)24-25(14)2/h4-9,12H,10-11H2,1-3H3,(H,22,23)/t12-/m0/s1
Reactome pathway
1.73E+3n/an/an/an/an/an/an/an/a
Universit£ di Ferrara
Curated by ChEMBL
Assay Description
Displacement of [3H]DPCPX from human adenosine A1 receptor expressed in CHO cells after 120 mins by scintillation spectrometry
J Med Chem 54: 5205-20 (2011)
Article DOI: 10.1021/jm2004738
BindingDB Entry DOI: 10.7270/Q21N81G6
Adenosine receptor A2a
(Homo sapiens (Human))
BDBM50348158
(CHEMBL1800787)
Show SMILES COc1cc(-c2nc3N(Cc4ccccc4)C(=O)N4C[C@H](C)N=C4c3[nH]2)n(C)n1 |r,c:23|
Show InChI InChI=1S/C20H21N7O2/c1-12-10-26-18(21-12)16-19(27(20(26)28)11-13-7-5-4-6-8-13)23-17(22-16)14-9-15(29-3)24-25(14)2/h4-9,12H,10-11H2,1-3H3,(H,22,23)/t12-/m0/s1
NCI pathway
Reactome pathway
>5.00E+3n/an/an/an/an/an/an/an/a
Universit£ di Ferrara
Curated by ChEMBL
Assay Description
Displacement of [3H]ZM 241385 from human adenosine A2A receptor expressed in CHO cells after 60 mins by scintillation spectrometry
J Med Chem 54: 5205-20 (2011)
Article DOI: 10.1021/jm2004738
BindingDB Entry DOI: 10.7270/Q21N81G6
Adenosine receptor A2b
(Homo sapiens (Human))
BDBM50348158
(CHEMBL1800787)
Show SMILES COc1cc(-c2nc3N(Cc4ccccc4)C(=O)N4C[C@H](C)N=C4c3[nH]2)n(C)n1 |r,c:23|
Show InChI InChI=1S/C20H21N7O2/c1-12-10-26-18(21-12)16-19(27(20(26)28)11-13-7-5-4-6-8-13)23-17(22-16)14-9-15(29-3)24-25(14)2/h4-9,12H,10-11H2,1-3H3,(H,22,23)/t12-/m0/s1
NCI pathway
Reactome pathway
n/an/a>5.00E+3n/an/an/an/an/an/a
Universit£ di Ferrara
Curated by ChEMBL
Assay Description
Antagonist activity human adenosine A2B receptor expressed in CHO cells assessed as inhibition of NECA-mediated [3H]cAMP accumulation after 150 mins ...
J Med Chem 54: 5205-20 (2011)
Article DOI: 10.1021/jm2004738
BindingDB Entry DOI: 10.7270/Q21N81G6
Adenosine receptor A3
(Homo sapiens (Human))
BDBM50348158
(CHEMBL1800787)
Show SMILES COc1cc(-c2nc3N(Cc4ccccc4)C(=O)N4C[C@H](C)N=C4c3[nH]2)n(C)n1 |r,c:23|
Show InChI InChI=1S/C20H21N7O2/c1-12-10-26-18(21-12)16-19(27(20(26)28)11-13-7-5-4-6-8-13)23-17(22-16)14-9-15(29-3)24-25(14)2/h4-9,12H,10-11H2,1-3H3,(H,22,23)/t12-/m0/s1
Reactome pathway
n/an/a 17.5n/an/an/an/an/an/a
Universit£ di Ferrara
Curated by ChEMBL
Assay Description
Antagonist activity human adenosine A3 receptor expressed in CHO cells assessed as blockade of Cl-IB-MECA-mediated inhibition of forskolin-stimulated...
J Med Chem 54: 5205-20 (2011)
Article DOI: 10.1021/jm2004738
BindingDB Entry DOI: 10.7270/Q21N81G6