BDBM50348404 CHEMBL1801009
SMILES: CC(C)(C(c1ccccc1)c1ccc(O)c(F)c1)C(=O)Nc1nccs1
InChI Key: InChIKey=PCJNAMBTUJABGN-UHFFFAOYSA-N
Data: 1 KI  4 EC50
Activity Spreadsheet -- Enzyme Inhibition Constant Data from BindingDB
Found 5 hits for monomerid = 50348404
Trg + Lig
Ki
nM
ΔG°
kcal/mole
IC50
nM
Kd
nM
EC50/IC50
nM
koff
s-1
kon
M-1s-1
pHTemp
°C
Glucocorticoid receptor
(Homo sapiens (Human))
BDBM50348404
(CHEMBL1801009)
Show SMILES CC(C)(C(c1ccccc1)c1ccc(O)c(F)c1)C(=O)Nc1nccs1
Show InChI InChI=1S/C20H19FN2O2S/c1-20(2,18(25)23-19-22-10-11-26-19)17(13-6-4-3-5-7-13)14-8-9-16(24)15(21)12-14/h3-12,17,24H,1-2H3,(H,22,23,25)
0.600n/an/an/an/an/an/an/an/a
Bristol-Myers Squibb Company
Curated by ChEMBL
Assay Description
Displacement of GS-red from GRapha by fluorescence polarization assay
J Med Chem 53: 8241-51 (2010)
Article DOI: 10.1021/jm100957a
BindingDB Entry DOI: 10.7270/Q2HX1DPW
Glucocorticoid receptor
(Homo sapiens (Human))
BDBM50348404
(CHEMBL1801009)
Show SMILES CC(C)(C(c1ccccc1)c1ccc(O)c(F)c1)C(=O)Nc1nccs1
Show InChI InChI=1S/C20H19FN2O2S/c1-20(2,18(25)23-19-22-10-11-26-19)17(13-6-4-3-5-7-13)14-8-9-16(24)15(21)12-14/h3-12,17,24H,1-2H3,(H,22,23,25)
n/an/an/an/a 37.7n/an/an/an/a
Bristol-Myers Squibb Company
Curated by ChEMBL
Assay Description
Transrepression activity of glucocorticoid receptor in human A549 cells assessed as inhibition of IL1beta-stimulated NFkappaB-dependent E-selectin tr...
J Med Chem 53: 8241-51 (2010)
Article DOI: 10.1021/jm100957a
BindingDB Entry DOI: 10.7270/Q2HX1DPW
Glucocorticoid receptor
(Homo sapiens (Human))
BDBM50348404
(CHEMBL1801009)
Show SMILES CC(C)(C(c1ccccc1)c1ccc(O)c(F)c1)C(=O)Nc1nccs1
Show InChI InChI=1S/C20H19FN2O2S/c1-20(2,18(25)23-19-22-10-11-26-19)17(13-6-4-3-5-7-13)14-8-9-16(24)15(21)12-14/h3-12,17,24H,1-2H3,(H,22,23,25)
n/an/an/an/a 51.1n/an/an/an/a
Bristol-Myers Squibb Company
Curated by ChEMBL
Assay Description
Transrepression activity of glucocorticoid receptor in human A549 cells expressing AP-1 assessed as inhibition of PMA-induced AP-1 activity by lucife...
J Med Chem 53: 8241-51 (2010)
Article DOI: 10.1021/jm100957a
BindingDB Entry DOI: 10.7270/Q2HX1DPW
Glucocorticoid receptor
(Homo sapiens (Human))
BDBM50348404
(CHEMBL1801009)
Show SMILES CC(C)(C(c1ccccc1)c1ccc(O)c(F)c1)C(=O)Nc1nccs1
Show InChI InChI=1S/C20H19FN2O2S/c1-20(2,18(25)23-19-22-10-11-26-19)17(13-6-4-3-5-7-13)14-8-9-16(24)15(21)12-14/h3-12,17,24H,1-2H3,(H,22,23,25)
n/an/an/an/a 216n/an/an/an/a
Bristol-Myers Squibb Company
Curated by ChEMBL
Assay Description
Transactivation activity of glucocorticoid receptor ligand binding domain expressed in human NP-1 Hela cells co-expressing GAL4 DNA binding domain by...
J Med Chem 53: 8241-51 (2010)
Article DOI: 10.1021/jm100957a
BindingDB Entry DOI: 10.7270/Q2HX1DPW
Glucocorticoid receptor
(Homo sapiens (Human))
BDBM50348404
(CHEMBL1801009)
Show SMILES CC(C)(C(c1ccccc1)c1ccc(O)c(F)c1)C(=O)Nc1nccs1
Show InChI InChI=1S/C20H19FN2O2S/c1-20(2,18(25)23-19-22-10-11-26-19)17(13-6-4-3-5-7-13)14-8-9-16(24)15(21)12-14/h3-12,17,24H,1-2H3,(H,22,23,25)
n/an/an/an/a 197n/an/an/an/a
Bristol-Myers Squibb Company
Curated by ChEMBL
Assay Description
Transactivation activity at glucocorticoid receptor in human 13D3/Huh7 cells assessed as induction of tyrosine aminotransferase activity after 24 hrs
J Med Chem 53: 8241-51 (2010)
Article DOI: 10.1021/jm100957a
BindingDB Entry DOI: 10.7270/Q2HX1DPW