BDBM50348438 CHEMBL1800944
SMILES: NC1=NC2(CCCC2)N(OCCCOc2ccc(cc2)C#N)C(N)=N1
InChI Key: InChIKey=FCOFPEQQDWYPSG-UHFFFAOYSA-N
Data: 1 IC50
Activity Spreadsheet -- Enzyme Inhibition Constant Data from BindingDB
Found 1 hit for monomerid = 50348438
Trg + Lig
Ki
nM
ΔG°
kcal/mole
IC50
nM
Kd
nM
EC50/IC50
nM
koff
s-1
kon
M-1s-1
pHTemp
°C
Dihydrofolate reductase (DHFR)
(Bos taurus (Cattle))
BDBM50348438
(CHEMBL1800944)
Show SMILES NC1=NC2(CCCC2)N(OCCCOc2ccc(cc2)C#N)C(N)=N1 |c:25,t:1|
Show InChI InChI=1S/C17H22N6O2/c18-12-13-4-6-14(7-5-13)24-10-3-11-25-23-16(20)21-15(19)22-17(23)8-1-2-9-17/h4-7H,1-3,8-11H2,(H4,19,20,21,22)
n/an/a 7.60n/an/an/an/an/an/a
National University of Singapore
Curated by ChEMBL
Assay Description
Inhibition of bovine liver DHFR using dihydrofolic acid substrate by UV-visible spectrophotometry
Bioorg Med Chem 18: 737-43 (2010)
Article DOI: 10.1016/j.bmc.2009.11.065
BindingDB Entry DOI: 10.7270/Q28C9X7M