null
SMILES: COC1CN(C1)c1nnc(C)c2c(C)n(nc12)-c1ccc(Cl)cc1OC(F)(F)F
InChI Key: InChIKey=IFQQMOIAYOMMPI-UHFFFAOYSA-N
Activity Spreadsheet -- Enzyme Inhibition Constant Data from BindingDB
Found 3 hits for monomerid = 50348454
Trg + Lig
Ki
nM
ΔG°
kcal/mole
IC50
nM
Kd
nM
EC50/IC50
nM
koff
s-1
kon
M-1s-1
pHTemp
°C
Potassium voltage-gated channel subfamily H member 2
(Homo sapiens (Human))
BDBM50348454
(CHEMBL1801191)
Show SMILES COC1CN(C1)c1nnc(C)c2c(C)n(nc12)-c1ccc(Cl)cc1OC(F)(F)F
Show InChI InChI=1S/C18H17ClF3N5O2/c1-9-15-10(2)27(13-5-4-11(19)6-14(13)29-18(20,21)22)25-16(15)17(24-23-9)26-7-12(8-26)28-3/h4-6,12H,7-8H2,1-3H3
Reactome pathway
n/an/a 4.00E+3n/an/an/an/an/an/a
GlaxoSmithKline
Curated by ChEMBL
Assay Description
Inhibition of human hERG
Bioorg Med Chem Lett 20: 4683-8 (2010)
Article DOI: 10.1016/j.bmcl.2010.05.026
BindingDB Entry DOI: 10.7270/Q2GQ6Z3D
Voltage-dependent calcium channel subunit alpha-2/delta-2
(Homo sapiens (Human))
BDBM50348454
(CHEMBL1801191)
Show SMILES COC1CN(C1)c1nnc(C)c2c(C)n(nc12)-c1ccc(Cl)cc1OC(F)(F)F
Show InChI InChI=1S/C18H17ClF3N5O2/c1-9-15-10(2)27(13-5-4-11(19)6-14(13)29-18(20,21)22)25-16(15)17(24-23-9)26-7-12(8-26)28-3/h4-6,12H,7-8H2,1-3H3
n/an/a 3.98E+3n/an/an/an/an/an/a
GlaxoSmithKline
Curated by ChEMBL
Assay Description
Binding affinity at voltage-gated calcium channel subunit alpha2delta2
Bioorg Med Chem Lett 20: 4683-8 (2010)
Article DOI: 10.1016/j.bmcl.2010.05.026
BindingDB Entry DOI: 10.7270/Q2GQ6Z3D
Voltage-dependent calcium channel subunit alpha-2/delta-1
(Homo sapiens (Human))
BDBM50348454
(CHEMBL1801191)
Show SMILES COC1CN(C1)c1nnc(C)c2c(C)n(nc12)-c1ccc(Cl)cc1OC(F)(F)F
Show InChI InChI=1S/C18H17ClF3N5O2/c1-9-15-10(2)27(13-5-4-11(19)6-14(13)29-18(20,21)22)25-16(15)17(24-23-9)26-7-12(8-26)28-3/h4-6,12H,7-8H2,1-3H3
n/an/a 8n/an/an/an/an/an/a
GlaxoSmithKline
Curated by ChEMBL
Assay Description
Binding affinity at voltage-gated calcium channel subunit alpha2delta1
Bioorg Med Chem Lett 20: 4683-8 (2010)
Article DOI: 10.1016/j.bmcl.2010.05.026
BindingDB Entry DOI: 10.7270/Q2GQ6Z3D