BDBM50348493 CHEMBL1801304
SMILES: COCCOc1cncc(c1)-c1ncc2CCc3c([nH]c4c3C(=O)NCC43CN(C)C3)-c2n1
InChI Key: InChIKey=HFESUJIHZXOWFN-UHFFFAOYSA-N
Data: 2 IC50
Activity Spreadsheet -- Enzyme Inhibition Constant Data from BindingDB
Found 2 hits for monomerid = 50348493
Trg + Lig
Ki
nM
ΔG°
kcal/mole
IC50
nM
Kd
nM
EC50/IC50
nM
koff
s-1
kon
M-1s-1
pHTemp
°C
MAP kinase-activated protein kinase 2
(Homo sapiens (Human))
BDBM50348493
(CHEMBL1801304)
Show SMILES COCCOc1cncc(c1)-c1ncc2CCc3c([nH]c4c3C(=O)NCC43CN(C)C3)-c2n1
Show InChI InChI=1S/C24H26N6O3/c1-30-12-24(13-30)11-27-23(31)18-17-4-3-14-9-26-22(29-19(14)20(17)28-21(18)24)15-7-16(10-25-8-15)33-6-5-32-2/h7-10,28H,3-6,11-13H2,1-2H3,(H,27,31)
NCI pathway
Reactome pathway
n/an/a 6.70E+3n/an/an/an/an/an/a
Novartis Institutes for BioMedical Research
Curated by ChEMBL
Assay Description
Inhibition of MK2 mediated anisomycin-stimulated hsp27 phosphorylation in human THP-1 cells by fluorometric analysis
Bioorg Med Chem Lett 20: 4719-23 (2010)
Checked by Author
Article DOI: 10.1016/j.bmcl.2010.04.023
BindingDB Entry DOI: 10.7270/Q2BZ66C2
MAP kinase-activated protein kinase 2
(Homo sapiens (Human))
BDBM50348493
(CHEMBL1801304)
Show SMILES COCCOc1cncc(c1)-c1ncc2CCc3c([nH]c4c3C(=O)NCC43CN(C)C3)-c2n1
Show InChI InChI=1S/C24H26N6O3/c1-30-12-24(13-30)11-27-23(31)18-17-4-3-14-9-26-22(29-19(14)20(17)28-21(18)24)15-7-16(10-25-8-15)33-6-5-32-2/h7-10,28H,3-6,11-13H2,1-2H3,(H,27,31)
NCI pathway
Reactome pathway
n/an/a 6n/an/an/an/an/an/a
Novartis Institutes for BioMedical Research
Curated by ChEMBL
Assay Description
Inhibition of human MK2 using biotinyl-AYSRALSRQLSSGVSEIRCOOH as substrate after 45 mins by FRET analysis
Bioorg Med Chem Lett 20: 4719-23 (2010)
Checked by Author
Article DOI: 10.1016/j.bmcl.2010.04.023
BindingDB Entry DOI: 10.7270/Q2BZ66C2