BDBM50348505 CHEMBL1801300
SMILES: Fc1ccc(cn1)-c1ncc2CCc3c([nH]c4CC5(CC5)NC(=O)c34)-c2n1
InChI Key: InChIKey=PQIFLRBLEHCDKA-UHFFFAOYSA-N
Data: 2 IC50
Activity Spreadsheet -- Enzyme Inhibition Constant Data from BindingDB
Found 2 hits for monomerid = 50348505
Trg + Lig
Ki
nM
ΔG°
kcal/mole
IC50
nM
Kd
nM
EC50/IC50
nM
koff
s-1
kon
M-1s-1
pHTemp
°C
MAP kinase-activated protein kinase 2
(Homo sapiens (Human))
BDBM50348505
(CHEMBL1801300)
Show SMILES Fc1ccc(cn1)-c1ncc2CCc3c([nH]c4CC5(CC5)NC(=O)c34)-c2n1
Show InChI InChI=1S/C20H16FN5O/c21-14-4-2-11(9-22-14)18-23-8-10-1-3-12-15-13(24-17(12)16(10)25-18)7-20(5-6-20)26-19(15)27/h2,4,8-9,24H,1,3,5-7H2,(H,26,27)
NCI pathway
Reactome pathway
n/an/a 1.20E+4n/an/an/an/an/an/a
Novartis Institutes for BioMedical Research
Curated by ChEMBL
Assay Description
Inhibition of MK2 mediated anisomycin-stimulated hsp27 phosphorylation in human THP-1 cells by fluorometric analysis
Bioorg Med Chem Lett 20: 4719-23 (2010)
Checked by Author
Article DOI: 10.1016/j.bmcl.2010.04.023
BindingDB Entry DOI: 10.7270/Q2BZ66C2
MAP kinase-activated protein kinase 2
(Homo sapiens (Human))
BDBM50348505
(CHEMBL1801300)
Show SMILES Fc1ccc(cn1)-c1ncc2CCc3c([nH]c4CC5(CC5)NC(=O)c34)-c2n1
Show InChI InChI=1S/C20H16FN5O/c21-14-4-2-11(9-22-14)18-23-8-10-1-3-12-15-13(24-17(12)16(10)25-18)7-20(5-6-20)26-19(15)27/h2,4,8-9,24H,1,3,5-7H2,(H,26,27)
NCI pathway
Reactome pathway
n/an/a 120n/an/an/an/an/an/a
Novartis Institutes for BioMedical Research
Curated by ChEMBL
Assay Description
Inhibition of human MK2 using biotinyl-AYSRALSRQLSSGVSEIRCOOH as substrate after 45 mins by FRET analysis
Bioorg Med Chem Lett 20: 4719-23 (2010)
Checked by Author
Article DOI: 10.1016/j.bmcl.2010.04.023
BindingDB Entry DOI: 10.7270/Q2BZ66C2