BDBM50348507 CHEMBL1801276
SMILES: Fc1ccccc1-c1cc2-c3[nH]c4CC5(CC5)NC(=O)c4c3CCc2cn1
InChI Key: InChIKey=OJIIULQRCICCLG-UHFFFAOYSA-N
Data: 2 IC50
Activity Spreadsheet -- Enzyme Inhibition Constant Data from BindingDB
Found 2 hits for monomerid = 50348507
Trg + Lig
Ki
nM
ΔG°
kcal/mole
IC50
nM
Kd
nM
EC50/IC50
nM
koff
s-1
kon
M-1s-1
pHTemp
°C
MAP kinase-activated protein kinase 2
(Homo sapiens (Human))
BDBM50348507
(CHEMBL1801276)
Show SMILES Fc1ccccc1-c1cc2-c3[nH]c4CC5(CC5)NC(=O)c4c3CCc2cn1
Show InChI InChI=1S/C22H18FN3O/c23-16-4-2-1-3-13(16)17-9-15-12(11-24-17)5-6-14-19-18(25-20(14)15)10-22(7-8-22)26-21(19)27/h1-4,9,11,25H,5-8,10H2,(H,26,27)
NCI pathway
Reactome pathway
n/an/a 700n/an/an/an/an/an/a
Novartis Institutes for BioMedical Research
Curated by ChEMBL
Assay Description
Inhibition of MK2 mediated anisomycin-stimulated hsp27 phosphorylation in human THP-1 cells by fluorometric analysis
Bioorg Med Chem Lett 20: 4719-23 (2010)
Checked by Author
Article DOI: 10.1016/j.bmcl.2010.04.023
BindingDB Entry DOI: 10.7270/Q2BZ66C2
MAP kinase-activated protein kinase 2
(Homo sapiens (Human))
BDBM50348507
(CHEMBL1801276)
Show SMILES Fc1ccccc1-c1cc2-c3[nH]c4CC5(CC5)NC(=O)c4c3CCc2cn1
Show InChI InChI=1S/C22H18FN3O/c23-16-4-2-1-3-13(16)17-9-15-12(11-24-17)5-6-14-19-18(25-20(14)15)10-22(7-8-22)26-21(19)27/h1-4,9,11,25H,5-8,10H2,(H,26,27)
NCI pathway
Reactome pathway
n/an/a 140n/an/an/an/an/an/a
Novartis Institutes for BioMedical Research
Curated by ChEMBL
Assay Description
Inhibition of human MK2 using biotinyl-AYSRALSRQLSSGVSEIRCOOH as substrate after 45 mins by FRET analysis
Bioorg Med Chem Lett 20: 4719-23 (2010)
Checked by Author
Article DOI: 10.1016/j.bmcl.2010.04.023
BindingDB Entry DOI: 10.7270/Q2BZ66C2