null
SMILES: Cc1cc2[C@H](CC3(CCN(CC3)C(=O)[C@@H]3CN(C[C@H]3c3ccc(F)cc3F)C(C)(C)C)c2cc1Cl)C(C)(C)C(=O)NCCO
InChI Key: InChIKey=RXPUDPFPHRKTPJ-REUBFRLUSA-N
Activity Spreadsheet -- Enzyme Inhibition Constant Data from BindingDB
Found 2 hits for monomerid = 50348568
Trg + Lig
Ki
nM
ΔG°
kcal/mole
IC50
nM
Kd
nM
EC50/IC50
nM
koff
s-1
kon
M-1s-1
pHTemp
°C
Melanocortin receptor 4
(Homo sapiens (Human))
BDBM50348568
(CHEMBL1801126)
Show SMILES Cc1cc2[C@H](CC3(CCN(CC3)C(=O)[C@@H]3CN(C[C@H]3c3ccc(F)cc3F)C(C)(C)C)c2cc1Cl)C(C)(C)C(=O)NCCO |r|
Show InChI InChI=1S/C35H46ClF2N3O3/c1-21-15-24-27(17-29(21)36)35(18-28(24)34(5,6)32(44)39-11-14-42)9-12-40(13-10-35)31(43)26-20-41(33(2,3)4)19-25(26)23-8-7-22(37)16-30(23)38/h7-8,15-17,25-26,28,42H,9-14,18-20H2,1-6H3,(H,39,44)/t25-,26+,28-/m0/s1
n/an/a 2.60n/an/an/an/an/an/a
Merck Research Laboratories
Curated by ChEMBL
Assay Description
Displacement of [125I]-NDP-R-MSH from human MC4R expressed in CHO cells after 1.5 hrs by scintillation counting
Bioorg Med Chem Lett 20: 4399-405 (2010)
Article DOI: 10.1016/j.bmcl.2010.06.062
BindingDB Entry DOI: 10.7270/Q23F4Q07
Melanocortin receptor 4
(Homo sapiens (Human))
BDBM50348568
(CHEMBL1801126)
Show SMILES Cc1cc2[C@H](CC3(CCN(CC3)C(=O)[C@@H]3CN(C[C@H]3c3ccc(F)cc3F)C(C)(C)C)c2cc1Cl)C(C)(C)C(=O)NCCO |r|
Show InChI InChI=1S/C35H46ClF2N3O3/c1-21-15-24-27(17-29(21)36)35(18-28(24)34(5,6)32(44)39-11-14-42)9-12-40(13-10-35)31(43)26-20-41(33(2,3)4)19-25(26)23-8-7-22(37)16-30(23)38/h7-8,15-17,25-26,28,42H,9-14,18-20H2,1-6H3,(H,39,44)/t25-,26+,28-/m0/s1
n/an/an/an/a 1.30n/an/an/an/a
Merck Research Laboratories
Curated by ChEMBL
Assay Description
Agonist activity at human MC4R expressed in CHO cells assessed as increase of alpha-MSH-stimulated cAMP release pretreated for 10 mins before alpha-M...
Bioorg Med Chem Lett 20: 4399-405 (2010)
Article DOI: 10.1016/j.bmcl.2010.06.062
BindingDB Entry DOI: 10.7270/Q23F4Q07