BDBM50348597 CHEMBL1801322
SMILES: Brc1cccc(c1)C1(Cc2ccccc2)c2ccccc2-c2nccn12
InChI Key: InChIKey=LFQYXAFLCDMJKF-UHFFFAOYSA-N
Data: 1 IC50
Activity Spreadsheet -- Enzyme Inhibition Constant Data from BindingDB
Found 1 hit for monomerid = 50348597
Trg + Lig
Ki
nM
ΔG°
kcal/mole
IC50
nM
Kd
nM
EC50/IC50
nM
koff
s-1
kon
M-1s-1
pHTemp
°C
Neuropeptide S receptor
(Homo sapiens (Human))
BDBM50348597
(CHEMBL1801322)
Show SMILES Brc1cccc(c1)C1(Cc2ccccc2)c2ccccc2-c2nccn12
Show InChI InChI=1S/C23H17BrN2/c24-19-10-6-9-18(15-19)23(16-17-7-2-1-3-8-17)21-12-5-4-11-20(21)22-25-13-14-26(22)23/h1-15H,16H2
Reactome pathway
n/an/a 1.73E+3n/an/an/an/an/an/a
Merck Research Laboratories
Curated by ChEMBL
Assay Description
Antagonist activity at human recombinant NPS receptor expressed in CHOK1 cells assessed as inhibition of NPS-induced calcium mobilization by FLIPR as...
Bioorg Med Chem Lett 20: 4704-8 (2010)
Article DOI: 10.1016/j.bmcl.2010.04.016
BindingDB Entry DOI: 10.7270/Q2ZS2WVZ