BDBM50348602 CHEMBL1800088
SMILES: Fc1ccc(cc1)C1(CC2CCOCC2)c2ccccc2-c2nccn12
InChI Key: InChIKey=RXXVIEXCMOKUEL-UHFFFAOYSA-N
Data: 1 IC50
Activity Spreadsheet -- Enzyme Inhibition Constant Data from BindingDB
Found 1 hit for monomerid = 50348602
Trg + Lig
Ki
nM
ΔG°
kcal/mole
IC50
nM
Kd
nM
EC50/IC50
nM
koff
s-1
kon
M-1s-1
pHTemp
°C
Neuropeptide S receptor
(Homo sapiens (Human))
BDBM50348602
(CHEMBL1800088)
Show SMILES Fc1ccc(cc1)C1(CC2CCOCC2)c2ccccc2-c2nccn12
Show InChI InChI=1S/C22H21FN2O/c23-18-7-5-17(6-8-18)22(15-16-9-13-26-14-10-16)20-4-2-1-3-19(20)21-24-11-12-25(21)22/h1-8,11-12,16H,9-10,13-15H2
Reactome pathway
n/an/a 660n/an/an/an/an/an/a
Merck Research Laboratories
Curated by ChEMBL
Assay Description
Antagonist activity at human recombinant NPS receptor expressed in CHOK1 cells assessed as inhibition of NPS-induced calcium mobilization by FLIPR as...
Bioorg Med Chem Lett 20: 4704-8 (2010)
Article DOI: 10.1016/j.bmcl.2010.04.016
BindingDB Entry DOI: 10.7270/Q2ZS2WVZ