BDBM50348605 CHEMBL1801329
SMILES: N#Cc1ccc(cc1)C1(CC2CCCC2)c2ccccc2-c2nccn12
InChI Key: InChIKey=CWKRGQQRVIMALU-UHFFFAOYSA-N
Data: 1 IC50
Activity Spreadsheet -- Enzyme Inhibition Constant Data from BindingDB
Found 1 hit for monomerid = 50348605
Trg + Lig
Ki
nM
ΔG°
kcal/mole
IC50
nM
Kd
nM
EC50/IC50
nM
koff
s-1
kon
M-1s-1
pHTemp
°C
Neuropeptide S receptor
(Homo sapiens (Human))
BDBM50348605
(CHEMBL1801329)
Show SMILES N#Cc1ccc(cc1)C1(CC2CCCC2)c2ccccc2-c2nccn12
Show InChI InChI=1S/C23H21N3/c24-16-18-9-11-19(12-10-18)23(15-17-5-1-2-6-17)21-8-4-3-7-20(21)22-25-13-14-26(22)23/h3-4,7-14,17H,1-2,5-6,15H2
Reactome pathway
n/an/a 145n/an/an/an/an/an/a
Merck Research Laboratories
Curated by ChEMBL
Assay Description
Antagonist activity at human recombinant NPS receptor expressed in CHOK1 cells assessed as inhibition of NPS-induced calcium mobilization by FLIPR as...
Bioorg Med Chem Lett 20: 4704-8 (2010)
Article DOI: 10.1016/j.bmcl.2010.04.016
BindingDB Entry DOI: 10.7270/Q2ZS2WVZ