BDBM50348610 CHEMBL1801335
SMILES: Clc1ccc(cc1)C1(CCC(=O)N2C3CCC2CCC3)c2ccccc2-c2nccn12
InChI Key: InChIKey=HORZLDFSYQKFIK-UHFFFAOYSA-N
Data: 1 IC50
Activity Spreadsheet -- Enzyme Inhibition Constant Data from BindingDB
Found 1 hit for monomerid = 50348610
Trg + Lig
Ki
nM
ΔG°
kcal/mole
IC50
nM
Kd
nM
EC50/IC50
nM
koff
s-1
kon
M-1s-1
pHTemp
°C
Neuropeptide S receptor
(Homo sapiens (Human))
BDBM50348610
(CHEMBL1801335)
Show SMILES Clc1ccc(cc1)C1(CCC(=O)N2C3CCC2CCC3)c2ccccc2-c2nccn12
Show InChI InChI=1S/C26H26ClN3O/c27-19-10-8-18(9-11-19)26(15-14-24(31)30-20-4-3-5-21(30)13-12-20)23-7-2-1-6-22(23)25-28-16-17-29(25)26/h1-2,6-11,16-17,20-21H,3-5,12-15H2
Reactome pathway
n/an/a 95n/an/an/an/an/an/a
Merck Research Laboratories
Curated by ChEMBL
Assay Description
Antagonist activity at human recombinant NPS receptor expressed in CHOK1 cells assessed as inhibition of NPS-induced calcium mobilization by FLIPR as...
Bioorg Med Chem Lett 20: 4704-8 (2010)
Article DOI: 10.1016/j.bmcl.2010.04.016
BindingDB Entry DOI: 10.7270/Q2ZS2WVZ