BDBM50348626 CHEMBL1801104
SMILES: Cc1nsc(Nc2nccn3c(cnc23)-c2cnn(C)c2)n1
InChI Key: InChIKey=LBBOLRRMFZXOJD-UHFFFAOYSA-N
Data: 1 IC50
Activity Spreadsheet -- Enzyme Inhibition Constant Data from BindingDB
Found 1 hit for monomerid = 50348626
Trg + Lig
Ki
nM
ΔG°
kcal/mole
IC50
nM
Kd
nM
EC50/IC50
nM
koff
s-1
kon
M-1s-1
pHTemp
°C
Aurora kinase A
(Homo sapiens (Human))
BDBM50348626
(CHEMBL1801104)
Show SMILES Cc1nsc(Nc2nccn3c(cnc23)-c2cnn(C)c2)n1
Show InChI InChI=1S/C13H12N8S/c1-8-17-13(22-19-8)18-11-12-15-6-10(21(12)4-3-14-11)9-5-16-20(2)7-9/h3-7H,1-2H3,(H,14,17,18,19)
NCI pathway
Reactome pathway
n/an/a>1.00E+4n/an/an/an/an/an/a
Merck Research Laboratories
Curated by ChEMBL
Assay Description
Inhibition of aurora A kinase using 5TAMRA-GRTGRRNSICOOH as substrate by fluorescent assay
Bioorg Med Chem Lett 20: 5170-4 (2010)
Article DOI: 10.1016/j.bmcl.2010.07.008
BindingDB Entry DOI: 10.7270/Q2Q81DGH