BDBM50348629 CHEMBL1801107
SMILES: CN(C)c1cccc(Nc2nccn3c(cnc23)-c2cnn(C)c2)c1
InChI Key: InChIKey=VZGMQXHFGYGCHX-UHFFFAOYSA-N
Data: 1 IC50
Activity Spreadsheet -- Enzyme Inhibition Constant Data from BindingDB
Found 1 hit for monomerid = 50348629
Trg + Lig
Ki
nM
ΔG°
kcal/mole
IC50
nM
Kd
nM
EC50/IC50
nM
koff
s-1
kon
M-1s-1
pHTemp
°C
Aurora kinase A
(Homo sapiens (Human))
BDBM50348629
(CHEMBL1801107)
Show SMILES CN(C)c1cccc(Nc2nccn3c(cnc23)-c2cnn(C)c2)c1
Show InChI InChI=1S/C18H19N7/c1-23(2)15-6-4-5-14(9-15)22-17-18-20-11-16(25(18)8-7-19-17)13-10-21-24(3)12-13/h4-12H,1-3H3,(H,19,22)
NCI pathway
Reactome pathway
n/an/a>1.00E+4n/an/an/an/an/an/a
Merck Research Laboratories
Curated by ChEMBL
Assay Description
Inhibition of aurora A kinase using 5TAMRA-GRTGRRNSICOOH as substrate by fluorescent assay
Bioorg Med Chem Lett 20: 5170-4 (2010)
Article DOI: 10.1016/j.bmcl.2010.07.008
BindingDB Entry DOI: 10.7270/Q2Q81DGH