BDBM50348673 CHEMBL1801050
SMILES: ONC(=O)C1(CCOCC1)S(=O)(=O)c1ccc(Oc2ccc(cc2)-c2ccccc2)cc1
InChI Key: InChIKey=SPEYRVQKGFNUCY-UHFFFAOYSA-N
Data: 7 IC50
Activity Spreadsheet -- Enzyme Inhibition Constant Data from BindingDB
Found 7 hits for monomerid = 50348673
Trg + Lig
Ki
nM
ΔG°
kcal/mole
IC50
nM
Kd
nM
EC50/IC50
nM
koff
s-1
kon
M-1s-1
pHTemp
°C
Matrix metalloproteinase-9
(Homo sapiens (Human))
BDBM50348673
(CHEMBL1801050)
Show SMILES ONC(=O)C1(CCOCC1)S(=O)(=O)c1ccc(Oc2ccc(cc2)-c2ccccc2)cc1
Show InChI InChI=1S/C24H23NO6S/c26-23(25-27)24(14-16-30-17-15-24)32(28,29)22-12-10-21(11-13-22)31-20-8-6-19(7-9-20)18-4-2-1-3-5-18/h1-13,27H,14-17H2,(H,25,26)
Reactome pathway
n/an/a 1.70n/an/an/an/an/an/a
Pfizer Inc.
Curated by ChEMBL
Assay Description
Inhibition of human MMP9 assessed as cleavage of fluorogenic peptide MCAPro-Leu-Gly-Leu-Dpa-Ala-Arg-NH2 by fluorometric assay
J Med Chem 53: 6653-80 (2010)
Article DOI: 10.1021/jm100669j
BindingDB Entry DOI: 10.7270/Q2KH0NQB
Matrix metalloproteinase-14 (MMP14)
(Homo sapiens (Human))
BDBM50348673
(CHEMBL1801050)
Show SMILES ONC(=O)C1(CCOCC1)S(=O)(=O)c1ccc(Oc2ccc(cc2)-c2ccccc2)cc1
Show InChI InChI=1S/C24H23NO6S/c26-23(25-27)24(14-16-30-17-15-24)32(28,29)22-12-10-21(11-13-22)31-20-8-6-19(7-9-20)18-4-2-1-3-5-18/h1-13,27H,14-17H2,(H,25,26)
n/an/a 20n/an/an/an/an/an/a
Pfizer Inc.
Curated by ChEMBL
Assay Description
Inhibition of human MMP14 assessed as cleavage of fluorogenic peptide MCAPro-Leu-Gly-Leu-Dpa-Ala-Arg-NH2 by fluorometric assay
J Med Chem 53: 6653-80 (2010)
Article DOI: 10.1021/jm100669j
BindingDB Entry DOI: 10.7270/Q2KH0NQB
Neutrophil collagenase
(Homo sapiens (Human))
BDBM50348673
(CHEMBL1801050)
Show SMILES ONC(=O)C1(CCOCC1)S(=O)(=O)c1ccc(Oc2ccc(cc2)-c2ccccc2)cc1
Show InChI InChI=1S/C24H23NO6S/c26-23(25-27)24(14-16-30-17-15-24)32(28,29)22-12-10-21(11-13-22)31-20-8-6-19(7-9-20)18-4-2-1-3-5-18/h1-13,27H,14-17H2,(H,25,26)
Reactome pathway
n/an/a 2.40n/an/an/an/an/an/a
Pfizer Inc.
Curated by ChEMBL
Assay Description
Inhibition of human MMP8 assessed as cleavage of fluorogenic peptide MCAPro-Leu-Gly-Leu-Dpa-Ala-Arg-NH2 by fluorometric assay
J Med Chem 53: 6653-80 (2010)
Article DOI: 10.1021/jm100669j
BindingDB Entry DOI: 10.7270/Q2KH0NQB
Collagenase 3
(Homo sapiens (Human))
BDBM50348673
(CHEMBL1801050)
Show SMILES ONC(=O)C1(CCOCC1)S(=O)(=O)c1ccc(Oc2ccc(cc2)-c2ccccc2)cc1
Show InChI InChI=1S/C24H23NO6S/c26-23(25-27)24(14-16-30-17-15-24)32(28,29)22-12-10-21(11-13-22)31-20-8-6-19(7-9-20)18-4-2-1-3-5-18/h1-13,27H,14-17H2,(H,25,26)
NCI pathway
Reactome pathway
n/an/a 0.25n/an/an/an/an/an/a
Pfizer Inc.
Curated by ChEMBL
Assay Description
Inhibition of human MMP13 assessed as cleavage of fluorogenic peptide MCAPro-Leu-Gly-Leu-Dpa-Ala-Arg-NH2 by fluorometric assay
J Med Chem 53: 6653-80 (2010)
Article DOI: 10.1021/jm100669j
BindingDB Entry DOI: 10.7270/Q2KH0NQB
72 kDa type IV collagenase
(Homo sapiens (Human))
BDBM50348673
(CHEMBL1801050)
Show SMILES ONC(=O)C1(CCOCC1)S(=O)(=O)c1ccc(Oc2ccc(cc2)-c2ccccc2)cc1
Show InChI InChI=1S/C24H23NO6S/c26-23(25-27)24(14-16-30-17-15-24)32(28,29)22-12-10-21(11-13-22)31-20-8-6-19(7-9-20)18-4-2-1-3-5-18/h1-13,27H,14-17H2,(H,25,26)
Reactome pathway
n/an/a 0.100n/an/an/an/an/an/a
Pfizer Inc.
Curated by ChEMBL
Assay Description
Inhibition of human MMP2 assessed as cleavage of fluorogenic peptide MCAPro-Leu-Gly-Leu-Dpa-Ala-Arg-NH2 by fluorometric assay
J Med Chem 53: 6653-80 (2010)
Article DOI: 10.1021/jm100669j
BindingDB Entry DOI: 10.7270/Q2KH0NQB
Interstitial collagenase
(Homo sapiens (Human))
BDBM50348673
(CHEMBL1801050)
Show SMILES ONC(=O)C1(CCOCC1)S(=O)(=O)c1ccc(Oc2ccc(cc2)-c2ccccc2)cc1
Show InChI InChI=1S/C24H23NO6S/c26-23(25-27)24(14-16-30-17-15-24)32(28,29)22-12-10-21(11-13-22)31-20-8-6-19(7-9-20)18-4-2-1-3-5-18/h1-13,27H,14-17H2,(H,25,26)
Reactome pathway
n/an/a 1.40E+3n/an/an/an/an/an/a
Pfizer Inc.
Curated by ChEMBL
Assay Description
Inhibition of human MMP1 expressed in human HT-1080 cells assessed as cleavage of fluorogenic peptide MCAPro-Leu-Gly-Leu-Dpa-Ala-Arg-NH2 by fluoromet...
J Med Chem 53: 6653-80 (2010)
Article DOI: 10.1021/jm100669j
BindingDB Entry DOI: 10.7270/Q2KH0NQB
Stromelysin-1
(Homo sapiens (Human))
BDBM50348673
(CHEMBL1801050)
Show SMILES ONC(=O)C1(CCOCC1)S(=O)(=O)c1ccc(Oc2ccc(cc2)-c2ccccc2)cc1
Show InChI InChI=1S/C24H23NO6S/c26-23(25-27)24(14-16-30-17-15-24)32(28,29)22-12-10-21(11-13-22)31-20-8-6-19(7-9-20)18-4-2-1-3-5-18/h1-13,27H,14-17H2,(H,25,26)
Reactome pathway
n/an/a 50n/an/an/an/an/an/a
Pfizer Inc.
Curated by ChEMBL
Assay Description
Inhibition of human MMP3 assessed as cleavage of fluorogenic peptide MCAPro-Leu-Gly-Leu-Dpa-Ala-Arg-NH2 by fluorometric assay
J Med Chem 53: 6653-80 (2010)
Article DOI: 10.1021/jm100669j
BindingDB Entry DOI: 10.7270/Q2KH0NQB