BDBM50348678 CHEMBL1801422
SMILES: ONC(=O)C1(CCN(CC1)C1CC1)S(=O)(=O)c1ccc(Oc2ccc3OCOc3c2)cc1
InChI Key: InChIKey=ZHIRJJYNGRGHQQ-UHFFFAOYSA-N
Data: 5 IC50
Activity Spreadsheet -- Enzyme Inhibition Constant Data from BindingDB
Found 5 hits for monomerid = 50348678
Trg + Lig
Ki
nM
ΔG°
kcal/mole
IC50
nM
Kd
nM
EC50/IC50
nM
koff
s-1
kon
M-1s-1
pHTemp
°C
Matrix metalloproteinase-14 (MMP14)
(Homo sapiens (Human))
BDBM50348678
(CHEMBL1801422)
Show SMILES ONC(=O)C1(CCN(CC1)C1CC1)S(=O)(=O)c1ccc(Oc2ccc3OCOc3c2)cc1
Show InChI InChI=1S/C22H24N2O7S/c25-21(23-26)22(9-11-24(12-10-22)15-1-2-15)32(27,28)18-6-3-16(4-7-18)31-17-5-8-19-20(13-17)30-14-29-19/h3-8,13,15,26H,1-2,9-12,14H2,(H,23,25)
n/an/a 0.730n/an/an/an/an/an/a
Pfizer Inc.
Curated by ChEMBL
Assay Description
Inhibition of human MMP14 assessed as cleavage of fluorogenic peptide MCAPro-Leu-Gly-Leu-Dpa-Ala-Arg-NH2 by fluorometric assay
J Med Chem 53: 6653-80 (2010)
Article DOI: 10.1021/jm100669j
BindingDB Entry DOI: 10.7270/Q2KH0NQB
Matrix metalloproteinase-9
(Homo sapiens (Human))
BDBM50348678
(CHEMBL1801422)
Show SMILES ONC(=O)C1(CCN(CC1)C1CC1)S(=O)(=O)c1ccc(Oc2ccc3OCOc3c2)cc1
Show InChI InChI=1S/C22H24N2O7S/c25-21(23-26)22(9-11-24(12-10-22)15-1-2-15)32(27,28)18-6-3-16(4-7-18)31-17-5-8-19-20(13-17)30-14-29-19/h3-8,13,15,26H,1-2,9-12,14H2,(H,23,25)
Reactome pathway
n/an/a<0.100n/an/an/an/an/an/a
Pfizer Inc.
Curated by ChEMBL
Assay Description
Inhibition of human MMP9 assessed as cleavage of fluorogenic peptide MCAPro-Leu-Gly-Leu-Dpa-Ala-Arg-NH2 by fluorometric assay
J Med Chem 53: 6653-80 (2010)
Article DOI: 10.1021/jm100669j
BindingDB Entry DOI: 10.7270/Q2KH0NQB
Collagenase 3
(Homo sapiens (Human))
BDBM50348678
(CHEMBL1801422)
Show SMILES ONC(=O)C1(CCN(CC1)C1CC1)S(=O)(=O)c1ccc(Oc2ccc3OCOc3c2)cc1
Show InChI InChI=1S/C22H24N2O7S/c25-21(23-26)22(9-11-24(12-10-22)15-1-2-15)32(27,28)18-6-3-16(4-7-18)31-17-5-8-19-20(13-17)30-14-29-19/h3-8,13,15,26H,1-2,9-12,14H2,(H,23,25)
NCI pathway
Reactome pathway
n/an/a 0.300n/an/an/an/an/an/a
Pfizer Inc.
Curated by ChEMBL
Assay Description
Inhibition of human MMP13 assessed as cleavage of fluorogenic peptide MCAPro-Leu-Gly-Leu-Dpa-Ala-Arg-NH2 by fluorometric assay
J Med Chem 53: 6653-80 (2010)
Article DOI: 10.1021/jm100669j
BindingDB Entry DOI: 10.7270/Q2KH0NQB
Interstitial collagenase
(Homo sapiens (Human))
BDBM50348678
(CHEMBL1801422)
Show SMILES ONC(=O)C1(CCN(CC1)C1CC1)S(=O)(=O)c1ccc(Oc2ccc3OCOc3c2)cc1
Show InChI InChI=1S/C22H24N2O7S/c25-21(23-26)22(9-11-24(12-10-22)15-1-2-15)32(27,28)18-6-3-16(4-7-18)31-17-5-8-19-20(13-17)30-14-29-19/h3-8,13,15,26H,1-2,9-12,14H2,(H,23,25)
Reactome pathway
n/an/a 1.00E+3n/an/an/an/an/an/a
Pfizer Inc.
Curated by ChEMBL
Assay Description
Inhibition of human MMP1 expressed in human HT-1080 cells assessed as cleavage of fluorogenic peptide MCAPro-Leu-Gly-Leu-Dpa-Ala-Arg-NH2 by fluoromet...
J Med Chem 53: 6653-80 (2010)
Article DOI: 10.1021/jm100669j
BindingDB Entry DOI: 10.7270/Q2KH0NQB
72 kDa type IV collagenase
(Homo sapiens (Human))
BDBM50348678
(CHEMBL1801422)
Show SMILES ONC(=O)C1(CCN(CC1)C1CC1)S(=O)(=O)c1ccc(Oc2ccc3OCOc3c2)cc1
Show InChI InChI=1S/C22H24N2O7S/c25-21(23-26)22(9-11-24(12-10-22)15-1-2-15)32(27,28)18-6-3-16(4-7-18)31-17-5-8-19-20(13-17)30-14-29-19/h3-8,13,15,26H,1-2,9-12,14H2,(H,23,25)
Reactome pathway
n/an/a 0.5n/an/an/an/an/an/a
Pfizer Inc.
Curated by ChEMBL
Assay Description
Inhibition of human MMP2 assessed as cleavage of fluorogenic peptide MCAPro-Leu-Gly-Leu-Dpa-Ala-Arg-NH2 by fluorometric assay
J Med Chem 53: 6653-80 (2010)
Article DOI: 10.1021/jm100669j
BindingDB Entry DOI: 10.7270/Q2KH0NQB