BDBM50349014 CHEMBL1807479
SMILES: O=C(Nc1cc(n[nH]1)-c1cccc(NS(=O)(=O)c2ccccc2)c1)c1ccc(OCCN2CCOCC2)cc1
InChI Key: InChIKey=SCXJWIMTVIDIFS-UHFFFAOYSA-N
Data: 3 IC50
Activity Spreadsheet -- Enzyme Inhibition Constant Data from BindingDB
Found 3 hits for monomerid = 50349014
Trg + Lig
Ki
nM
ΔG°
kcal/mole
IC50
nM
Kd
nM
EC50/IC50
nM
koff
s-1
kon
M-1s-1
pHTemp
°C
Vascular endothelial growth factor receptor 1
(Homo sapiens (Human))
BDBM50349014
(CHEMBL1807479)
Show SMILES O=C(Nc1cc(n[nH]1)-c1cccc(NS(=O)(=O)c2ccccc2)c1)c1ccc(OCCN2CCOCC2)cc1
Show InChI InChI=1S/C28H29N5O5S/c34-28(21-9-11-24(12-10-21)38-18-15-33-13-16-37-17-14-33)29-27-20-26(30-31-27)22-5-4-6-23(19-22)32-39(35,36)25-7-2-1-3-8-25/h1-12,19-20,32H,13-18H2,(H2,29,30,31,34)
n/an/a>1.00E+3n/an/an/an/an/an/a
National Health Research Institutes
Curated by ChEMBL
Assay Description
Inhibition of recombinant GST-tagged VEGFR1 expressed in Sf9 insect cells after 120 mins by Kinase-Glo assay
Bioorg Med Chem 19: 4173-82 (2011)
Article DOI: 10.1016/j.bmc.2011.06.016
BindingDB Entry DOI: 10.7270/Q2CR5TQV
Receptor-type tyrosine-protein kinase FLT3
(Homo sapiens (Human))
BDBM50349014
(CHEMBL1807479)
Show SMILES O=C(Nc1cc(n[nH]1)-c1cccc(NS(=O)(=O)c2ccccc2)c1)c1ccc(OCCN2CCOCC2)cc1
Show InChI InChI=1S/C28H29N5O5S/c34-28(21-9-11-24(12-10-21)38-18-15-33-13-16-37-17-14-33)29-27-20-26(30-31-27)22-5-4-6-23(19-22)32-39(35,36)25-7-2-1-3-8-25/h1-12,19-20,32H,13-18H2,(H2,29,30,31,34)
n/an/a 70n/an/an/an/an/an/a
National Health Research Institutes
Curated by ChEMBL
Assay Description
Inhibition of GST-tagged FLT3 expressing wild type kinase domain expressed in Sf9 insect cells after 4 hrs by Kinase-Glo assay
Bioorg Med Chem 19: 4173-82 (2011)
Article DOI: 10.1016/j.bmc.2011.06.016
BindingDB Entry DOI: 10.7270/Q2CR5TQV
Vascular endothelial growth factor receptor 2
(Homo sapiens (Human))
BDBM50349014
(CHEMBL1807479)
Show SMILES O=C(Nc1cc(n[nH]1)-c1cccc(NS(=O)(=O)c2ccccc2)c1)c1ccc(OCCN2CCOCC2)cc1
Show InChI InChI=1S/C28H29N5O5S/c34-28(21-9-11-24(12-10-21)38-18-15-33-13-16-37-17-14-33)29-27-20-26(30-31-27)22-5-4-6-23(19-22)32-39(35,36)25-7-2-1-3-8-25/h1-12,19-20,32H,13-18H2,(H2,29,30,31,34)
NCI pathway
Reactome pathway
n/an/a>1.00E+3n/an/an/an/an/an/a
National Health Research Institutes
Curated by ChEMBL
Assay Description
Inhibition of recombinant GST-tagged VEGFR2 expressed in Sf9 insect cells after 120 mins by Kinase-Glo assay
Bioorg Med Chem 19: 4173-82 (2011)
Article DOI: 10.1016/j.bmc.2011.06.016
BindingDB Entry DOI: 10.7270/Q2CR5TQV