BDBM50349037 CHEMBL1807796
SMILES: C[C@@H]1Nc2cc(ccc2C(N)=O)-n2c3CC(C)(C)CC(=O)c3c(C)c2CCCN([C@H]1C)C(C)=O
InChI Key: InChIKey=MMJUEHBYHKCNKW-IRXDYDNUSA-N
Data: 1 IC50
Activity Spreadsheet -- Enzyme Inhibition Constant Data from BindingDB
Found 1 hit for monomerid = 50349037
Trg + Lig
Ki
nM
ΔG°
kcal/mole
IC50
nM
Kd
nM
EC50/IC50
nM
koff
s-1
kon
M-1s-1
pHTemp
°C
Heat shock protein HSP 90-alpha
(Homo sapiens (Human))
BDBM50349037
(CHEMBL1807796)
Show SMILES C[C@@H]1Nc2cc(ccc2C(N)=O)-n2c3CC(C)(C)CC(=O)c3c(C)c2CCCN([C@H]1C)C(C)=O |r|
Show InChI InChI=1S/C27H36N4O3/c1-15-22-8-7-11-30(18(4)32)17(3)16(2)29-21-12-19(9-10-20(21)26(28)34)31(22)23-13-27(5,6)14-24(33)25(15)23/h9-10,12,16-17,29H,7-8,11,13-14H2,1-6H3,(H2,28,34)/t16-,17-/m0/s1
NCI pathway
Reactome pathway
n/an/a 85n/an/an/an/an/an/a
Pfizer Inc.
Curated by ChEMBL
Assay Description
Binding affinity to HSP90alpha after 3 hrs by fluorescence polarization assay
Bioorg Med Chem Lett 21: 4602-7 (2011)
Article DOI: 10.1016/j.bmcl.2011.05.102
BindingDB Entry DOI: 10.7270/Q2833SD5