BDBM50349087 CHEMBL1807999
SMILES: COc1ccc(cc1OC)C(=O)c1coc2c1C(=O)C(=O)C(Br)=C2Br
InChI Key: InChIKey=OVLLPDKXUQIASU-UHFFFAOYSA-N
Data: 2 IC50
Activity Spreadsheet -- Enzyme Inhibition Constant Data from BindingDB
Found 2 hits for monomerid = 50349087
Trg + Lig
Ki
nM
ΔG°
kcal/mole
IC50
nM
Kd
nM
EC50/IC50
nM
koff
s-1
kon
M-1s-1
pHTemp
°C
Peptide deformylase
(Escherichia coli)
BDBM50349087
(CHEMBL1807999)
Show SMILES COc1ccc(cc1OC)C(=O)c1coc2c1C(=O)C(=O)C(Br)=C2Br |c:24|
Show InChI InChI=1S/C17H10Br2O6/c1-23-9-4-3-7(5-10(9)24-2)14(20)8-6-25-17-11(8)15(21)16(22)12(18)13(17)19/h3-6H,1-2H3
n/an/a>1.00E+5n/an/an/an/an/an/a
Memorial Sloan-Kettering Cancer Center
Curated by ChEMBL
Assay Description
Inhibition of Escherichia coli peptide deformylase after 1 hr by fluorescence polarization based competition assay
Bioorg Med Chem Lett 21: 4528-32 (2011)
Article DOI: 10.1016/j.bmcl.2011.05.129
BindingDB Entry DOI: 10.7270/Q2VT1SGT
Peptide deformylase, mitochondrial
(Homo sapiens (Human))
BDBM50349087
(CHEMBL1807999)
Show SMILES COc1ccc(cc1OC)C(=O)c1coc2c1C(=O)C(=O)C(Br)=C2Br |c:24|
Show InChI InChI=1S/C17H10Br2O6/c1-23-9-4-3-7(5-10(9)24-2)14(20)8-6-25-17-11(8)15(21)16(22)12(18)13(17)19/h3-6H,1-2H3
n/an/a 1.00E+4n/an/an/an/an/an/a
Memorial Sloan-Kettering Cancer Center
Curated by ChEMBL
Assay Description
Inhibition of human peptide deformylase after 1 hr by fluorescence polarization based competition assay
Bioorg Med Chem Lett 21: 4528-32 (2011)
Article DOI: 10.1016/j.bmcl.2011.05.129
BindingDB Entry DOI: 10.7270/Q2VT1SGT