BDBM50349193 CHEMBL1807644
SMILES: COC1=C(C)[C@@H]2CC(=O)O[C@@H]3C[C@H]4[C@H](C)[C@@H](O)[C@H](O)C(=O)[C@]4(C)[C@@H](C1=O)[C@]23C
InChI Key: InChIKey=CWVPFDLFQUVWQC-ZUEPXWORSA-N
Data: 2 EC50
Activity Spreadsheet -- Enzyme Inhibition Constant Data from BindingDB
Found 2 hits for monomerid = 50349193
Trg + Lig
Ki
nM
ΔG°
kcal/mole
IC50
nM
Kd
nM
EC50/IC50
nM
koff
s-1
kon
M-1s-1
pHTemp
°C
Transcription factor Jun
(Homo sapiens (Human))
BDBM50349193
(CHEMBL1807644)
Show SMILES COC1=C(C)[C@@H]2CC(=O)O[C@@H]3C[C@H]4[C@H](C)[C@@H](O)[C@H](O)C(=O)[C@]4(C)[C@@H](C1=O)[C@]23C |r,c:2|
Show InChI InChI=1S/C21H28O7/c1-8-10-6-12-20(3)11(7-13(22)28-12)9(2)17(27-5)16(25)18(20)21(10,4)19(26)15(24)14(8)23/h8,10-12,14-15,18,23-24H,6-7H2,1-5H3/t8-,10-,11-,12+,14+,15-,18-,20+,21-/m0/s1
n/an/an/an/a 1.49E+3n/an/an/an/a
NCI-Frederick
Curated by ChEMBL
Assay Description
Inhibition of TPA-induced AP-1 activity expressed in human HEK293T cells treated 1 hr before TPA challenge measured after 18 hrs by FRET based beta-l...
Bioorg Med Chem Lett 21: 4397-9 (2011)
Article DOI: 10.1016/j.bmcl.2011.06.044
BindingDB Entry DOI: 10.7270/Q2ZK5H1Q
Transcription factor Jun
(Homo sapiens (Human))
BDBM50349193
(CHEMBL1807644)
Show SMILES COC1=C(C)[C@@H]2CC(=O)O[C@@H]3C[C@H]4[C@H](C)[C@@H](O)[C@H](O)C(=O)[C@]4(C)[C@@H](C1=O)[C@]23C |r,c:2|
Show InChI InChI=1S/C21H28O7/c1-8-10-6-12-20(3)11(7-13(22)28-12)9(2)17(27-5)16(25)18(20)21(10,4)19(26)15(24)14(8)23/h8,10-12,14-15,18,23-24H,6-7H2,1-5H3/t8-,10-,11-,12+,14+,15-,18-,20+,21-/m0/s1
n/an/an/an/a 130n/an/an/an/a
University of Texas Medical Branch
Curated by ChEMBL
Assay Description
Inhibition of AP-1 (unknown origin) by FRET assay
J Med Chem 57: 6930-48 (2014)
Article DOI: 10.1021/jm5004733
BindingDB Entry DOI: 10.7270/Q2222WDT