BDBM50349323 CHEMBL1807927
SMILES: CC(Cn1c(C)ncc1[N+]([O-])=O)OC(=O)\C=C\c1cccc(Br)c1
InChI Key: InChIKey=FTDOPOVRDGPMBX-VOTSOKGWSA-N
Data: 1 KI  1 IC50
Activity Spreadsheet -- Enzyme Inhibition Constant Data from BindingDB
Found 2 hits for monomerid = 50349323
Trg + Lig
Ki
nM
ΔG°
kcal/mole
IC50
nM
Kd
nM
EC50/IC50
nM
koff
s-1
kon
M-1s-1
pHTemp
°C
Beta-ketoacyl-ACP synthase III (FabH)
(Escherichia coli)
BDBM50349323
(CHEMBL1807927)
Show SMILES CC(Cn1c(C)ncc1[N+]([O-])=O)OC(=O)\C=C\c1cccc(Br)c1
Show InChI InChI=1S/C16H16BrN3O4/c1-11(10-19-12(2)18-9-15(19)20(22)23)24-16(21)7-6-13-4-3-5-14(17)8-13/h3-9,11H,10H2,1-2H3/b7-6+
0.000214n/an/an/an/an/an/an/an/a
Nanjing University
Curated by ChEMBL
Assay Description
Inhibition of N-terminal His-tagged Escherichia coli FabH expressed in Escherichia coli BL21 (DE3) using [3H]acetyl-coA after 25 mins by liquid scint...
Bioorg Med Chem 19: 4513-9 (2011)
Article DOI: 10.1016/j.bmc.2011.06.021
BindingDB Entry DOI: 10.7270/Q2XK8FWX
Beta-ketoacyl-ACP synthase III (FabH)
(Escherichia coli)
BDBM50349323
(CHEMBL1807927)
Show SMILES CC(Cn1c(C)ncc1[N+]([O-])=O)OC(=O)\C=C\c1cccc(Br)c1
Show InChI InChI=1S/C16H16BrN3O4/c1-11(10-19-12(2)18-9-15(19)20(22)23)24-16(21)7-6-13-4-3-5-14(17)8-13/h3-9,11H,10H2,1-2H3/b7-6+
n/an/a 2.75E+4n/an/an/an/an/an/a
Nanjing University
Curated by ChEMBL
Assay Description
Inhibition of N-terminal His-tagged Escherichia coli FabH expressed in Escherichia coli BL21 (DE3) using [3H]acetyl-coA after 25 mins by liquid scint...
Bioorg Med Chem 19: 4513-9 (2011)
Article DOI: 10.1016/j.bmc.2011.06.021
BindingDB Entry DOI: 10.7270/Q2XK8FWX