BDBM50349329 CHEMBL1807661
SMILES: CC(Cn1c(C)ncc1[N+]([O-])=O)OC(=O)\C=C\c1cccc2ccccc12
InChI Key: InChIKey=LFAMAZNGBGZHCL-ZHACJKMWSA-N
Data: 1 KI  1 IC50
Activity Spreadsheet -- Enzyme Inhibition Constant Data from BindingDB
Found 2 hits for monomerid = 50349329
Trg + Lig
Ki
nM
ΔG°
kcal/mole
IC50
nM
Kd
nM
EC50/IC50
nM
koff
s-1
kon
M-1s-1
pHTemp
°C
Beta-ketoacyl-ACP synthase III (FabH)
(Escherichia coli)
BDBM50349329
(CHEMBL1807661)
Show SMILES CC(Cn1c(C)ncc1[N+]([O-])=O)OC(=O)\C=C\c1cccc2ccccc12
Show InChI InChI=1S/C20H19N3O4/c1-14(13-22-15(2)21-12-19(22)23(25)26)27-20(24)11-10-17-8-5-7-16-6-3-4-9-18(16)17/h3-12,14H,13H2,1-2H3/b11-10+
0.000443n/an/an/an/an/an/an/an/a
Nanjing University
Curated by ChEMBL
Assay Description
Inhibition of N-terminal His-tagged Escherichia coli FabH expressed in Escherichia coli BL21 (DE3) using [3H]acetyl-coA after 25 mins by liquid scint...
Bioorg Med Chem 19: 4513-9 (2011)
Article DOI: 10.1016/j.bmc.2011.06.021
BindingDB Entry DOI: 10.7270/Q2XK8FWX
Beta-ketoacyl-ACP synthase III (FabH)
(Escherichia coli)
BDBM50349329
(CHEMBL1807661)
Show SMILES CC(Cn1c(C)ncc1[N+]([O-])=O)OC(=O)\C=C\c1cccc2ccccc12
Show InChI InChI=1S/C20H19N3O4/c1-14(13-22-15(2)21-12-19(22)23(25)26)27-20(24)11-10-17-8-5-7-16-6-3-4-9-18(16)17/h3-12,14H,13H2,1-2H3/b11-10+
n/an/a 4.89E+4n/an/an/an/an/an/a
Nanjing University
Curated by ChEMBL
Assay Description
Inhibition of N-terminal His-tagged Escherichia coli FabH expressed in Escherichia coli BL21 (DE3) using [3H]acetyl-coA after 25 mins by liquid scint...
Bioorg Med Chem 19: 4513-9 (2011)
Article DOI: 10.1016/j.bmc.2011.06.021
BindingDB Entry DOI: 10.7270/Q2XK8FWX