BDBM50349540 CHEMBL1808869
SMILES: Cc1cc(no1)C(=O)N1CCCC1c1ccc(nc1)-c1cccc(Cl)c1
InChI Key: InChIKey=DAFZNNUZXVOGHF-UHFFFAOYSA-N
Data: 1 KI  1 IC50
Activity Spreadsheet -- Enzyme Inhibition Constant Data from BindingDB
Found 2 hits for monomerid = 50349540
Trg + Lig
Ki
nM
ΔG°
kcal/mole
IC50
nM
Kd
nM
EC50/IC50
nM
koff
s-1
kon
M-1s-1
pHTemp
°C
Metabotropic glutamate receptor 5
(Homo sapiens (Human))
BDBM50349540
(CHEMBL1808869)
Show SMILES Cc1cc(no1)C(=O)N1CCCC1c1ccc(nc1)-c1cccc(Cl)c1
Show InChI InChI=1S/C20H18ClN3O2/c1-13-10-18(23-26-13)20(25)24-9-3-6-19(24)15-7-8-17(22-12-15)14-4-2-5-16(21)11-14/h2,4-5,7-8,10-12,19H,3,6,9H2,1H3
540n/an/an/an/an/an/an/an/a
Lundbeck Research USA, Inc.
Curated by ChEMBL
Assay Description
Displacement of [3H]-MPEP from human mGluR5 expressed in CHO cells after 60 mins
Bioorg Med Chem Lett 21: 4891-9 (2011)
Article DOI: 10.1016/j.bmcl.2011.06.014
BindingDB Entry DOI: 10.7270/Q2CN748G
Metabotropic glutamate receptor 5
(Homo sapiens (Human))
BDBM50349540
(CHEMBL1808869)
Show SMILES Cc1cc(no1)C(=O)N1CCCC1c1ccc(nc1)-c1cccc(Cl)c1
Show InChI InChI=1S/C20H18ClN3O2/c1-13-10-18(23-26-13)20(25)24-9-3-6-19(24)15-7-8-17(22-12-15)14-4-2-5-16(21)11-14/h2,4-5,7-8,10-12,19H,3,6,9H2,1H3
n/an/a 41n/an/an/an/an/an/a
Lundbeck Research USA, Inc.
Curated by ChEMBL
Assay Description
Negative allosteric modulation of human mGlu5 receptor expressed in HEK293 cells assessed as inhibition of glutamate-induced calcium mobilization aft...
Bioorg Med Chem Lett 21: 4891-9 (2011)
Article DOI: 10.1016/j.bmcl.2011.06.014
BindingDB Entry DOI: 10.7270/Q2CN748G