BDBM50349542 CHEMBL1808866
SMILES: Clc1cccc(c1)-c1ccc(cn1)C1CCCN1C(=O)c1cccs1
InChI Key: InChIKey=ILFNJXKQDRVMOX-UHFFFAOYSA-N
Data: 1 KI  1 IC50
Activity Spreadsheet -- Enzyme Inhibition Constant Data from BindingDB
Found 2 hits for monomerid = 50349542
Trg + Lig
Ki
nM
ΔG°
kcal/mole
IC50
nM
Kd
nM
EC50/IC50
nM
koff
s-1
kon
M-1s-1
pHTemp
°C
Metabotropic glutamate receptor 5
(Homo sapiens (Human))
BDBM50349542
(CHEMBL1808866)
Show SMILES Clc1cccc(c1)-c1ccc(cn1)C1CCCN1C(=O)c1cccs1
Show InChI InChI=1S/C20H17ClN2OS/c21-16-5-1-4-14(12-16)17-9-8-15(13-22-17)18-6-2-10-23(18)20(24)19-7-3-11-25-19/h1,3-5,7-9,11-13,18H,2,6,10H2
89n/an/an/an/an/an/an/an/a
Lundbeck Research USA, Inc.
Curated by ChEMBL
Assay Description
Displacement of [3H]-MPEP from human mGluR5 expressed in CHO cells after 60 mins
Bioorg Med Chem Lett 21: 4891-9 (2011)
Article DOI: 10.1016/j.bmcl.2011.06.014
BindingDB Entry DOI: 10.7270/Q2CN748G
Metabotropic glutamate receptor 5
(Homo sapiens (Human))
BDBM50349542
(CHEMBL1808866)
Show SMILES Clc1cccc(c1)-c1ccc(cn1)C1CCCN1C(=O)c1cccs1
Show InChI InChI=1S/C20H17ClN2OS/c21-16-5-1-4-14(12-16)17-9-8-15(13-22-17)18-6-2-10-23(18)20(24)19-7-3-11-25-19/h1,3-5,7-9,11-13,18H,2,6,10H2
n/an/a 8n/an/an/an/an/an/a
Lundbeck Research USA, Inc.
Curated by ChEMBL
Assay Description
Negative allosteric modulation of human mGlu5 receptor expressed in HEK293 cells assessed as inhibition of glutamate-induced calcium mobilization aft...
Bioorg Med Chem Lett 21: 4891-9 (2011)
Article DOI: 10.1016/j.bmcl.2011.06.014
BindingDB Entry DOI: 10.7270/Q2CN748G