BDBM50349616 CHEMBL1808956
SMILES: CCOC(=O)CN(Cc1ccc(F)cc1)c1ccc2N(C)CC(C)(COc3ccc(cc3)C(N)=N)Oc2c1
InChI Key: InChIKey=PFIMMJZGVMTLHR-UHFFFAOYSA-N
Data: 3 KI  2 IC50
Activity Spreadsheet -- Enzyme Inhibition Constant Data from BindingDB
Found 5 hits for monomerid = 50349616
Trg + Lig
Ki
nM
ΔG°
kcal/mole
IC50
nM
Kd
nM
EC50/IC50
nM
koff
s-1
kon
M-1s-1
pHTemp
°C
Prothrombin
(Homo sapiens (Human))
BDBM50349616
(CHEMBL1808956)
Show SMILES CCOC(=O)CN(Cc1ccc(F)cc1)c1ccc2N(C)CC(C)(COc3ccc(cc3)C(N)=N)Oc2c1
Show InChI InChI=1S/C29H33FN4O4/c1-4-36-27(35)17-34(16-20-5-9-22(30)10-6-20)23-11-14-25-26(15-23)38-29(2,18-33(25)3)19-37-24-12-7-21(8-13-24)28(31)32/h5-15H,4,16-19H2,1-3H3,(H3,31,32)
310n/an/an/an/an/an/an/an/a
University of Ljubljana
Curated by ChEMBL
Assay Description
Inhibition of thrombin using S-2238 as substrate after 15 mins by spectrophotometric analysis
Bioorg Med Chem Lett 21: 4705-9 (2011)
Article DOI: 10.1016/j.bmcl.2011.06.089
BindingDB Entry DOI: 10.7270/Q2445MTB
Prothrombin
(Homo sapiens (Human))
BDBM50349616
(CHEMBL1808956)
Show SMILES CCOC(=O)CN(Cc1ccc(F)cc1)c1ccc2N(C)CC(C)(COc3ccc(cc3)C(N)=N)Oc2c1
Show InChI InChI=1S/C29H33FN4O4/c1-4-36-27(35)17-34(16-20-5-9-22(30)10-6-20)23-11-14-25-26(15-23)38-29(2,18-33(25)3)19-37-24-12-7-21(8-13-24)28(31)32/h5-15H,4,16-19H2,1-3H3,(H3,31,32)
360n/an/an/an/an/an/an/an/a
University of Ljubljana
Curated by ChEMBL
Assay Description
Inhibition of thrombin using S-2238 as substrate preincubated for 15 mins prior substrate addition measured for every 10 secs by spectrophotometry
Eur J Med Chem 50: 255-63 (2012)
Article DOI: 10.1016/j.ejmech.2012.01.059
BindingDB Entry DOI: 10.7270/Q2KK9C7V
Coagulation factor X
(Homo sapiens (Human))
BDBM50349616
(CHEMBL1808956)
Show SMILES CCOC(=O)CN(Cc1ccc(F)cc1)c1ccc2N(C)CC(C)(COc3ccc(cc3)C(N)=N)Oc2c1
Show InChI InChI=1S/C29H33FN4O4/c1-4-36-27(35)17-34(16-20-5-9-22(30)10-6-20)23-11-14-25-26(15-23)38-29(2,18-33(25)3)19-37-24-12-7-21(8-13-24)28(31)32/h5-15H,4,16-19H2,1-3H3,(H3,31,32)
Reactome pathway
1.60E+3n/an/an/an/an/an/an/an/a
University of Ljubljana
Curated by ChEMBL
Assay Description
Inhibition of factor 10a using S-2222 as substrate preincubated for 15 mins prior substrate addition measured for every 10 secs by spectrophotometry
Eur J Med Chem 50: 255-63 (2012)
Article DOI: 10.1016/j.ejmech.2012.01.059
BindingDB Entry DOI: 10.7270/Q2KK9C7V
ITGAV/ITGB3
(Homo sapiens (Human))
BDBM50349616
(CHEMBL1808956)
Show SMILES CCOC(=O)CN(Cc1ccc(F)cc1)c1ccc2N(C)CC(C)(COc3ccc(cc3)C(N)=N)Oc2c1
Show InChI InChI=1S/C29H33FN4O4/c1-4-36-27(35)17-34(16-20-5-9-22(30)10-6-20)23-11-14-25-26(15-23)38-29(2,18-33(25)3)19-37-24-12-7-21(8-13-24)28(31)32/h5-15H,4,16-19H2,1-3H3,(H3,31,32)
n/an/a>1.00E+5n/an/an/an/an/an/a
University of Ljubljana
Curated by ChEMBL
Assay Description
Displacement of biotinylated fibrinogen from human alpha5-beta3 receptor after 2 hrs by chemiluminescence assay
Eur J Med Chem 50: 255-63 (2012)
Article DOI: 10.1016/j.ejmech.2012.01.059
BindingDB Entry DOI: 10.7270/Q2KK9C7V
Integrin alpha-IIb/beta-3
(Homo sapiens (Human))
BDBM50349616
(CHEMBL1808956)
Show SMILES CCOC(=O)CN(Cc1ccc(F)cc1)c1ccc2N(C)CC(C)(COc3ccc(cc3)C(N)=N)Oc2c1
Show InChI InChI=1S/C29H33FN4O4/c1-4-36-27(35)17-34(16-20-5-9-22(30)10-6-20)23-11-14-25-26(15-23)38-29(2,18-33(25)3)19-37-24-12-7-21(8-13-24)28(31)32/h5-15H,4,16-19H2,1-3H3,(H3,31,32)
n/an/a>1.00E+5n/an/an/an/an/an/a
University of Ljubljana
Curated by ChEMBL
Assay Description
Displacement of biotinylated fibrinogen from human alpha2b-beta3 receptor after 2 hrs by chemiluminescence assay
Eur J Med Chem 50: 255-63 (2012)
Article DOI: 10.1016/j.ejmech.2012.01.059
BindingDB Entry DOI: 10.7270/Q2KK9C7V