BDBM50349672 CHEMBL1809038
SMILES: OCCn1cc2C[C@H]3N(C[C@@H](C=C3c3cccc1c23)C(=O)N1CCCC1)C(=O)Nc1ccccc1
InChI Key: InChIKey=JLYWDONWNIMGQM-CJFMBICVSA-N
Data: 4 IC50
Activity Spreadsheet -- Enzyme Inhibition Constant Data from BindingDB
Found 4 hits for monomerid = 50349672
Trg + Lig
Ki
nM
ΔG°
kcal/mole
IC50
nM
Kd
nM
EC50/IC50
nM
koff
s-1
kon
M-1s-1
pHTemp
°C
chemokine (C-X-C motif) receptor 3
(Homo sapiens (Human))
BDBM50349672
(CHEMBL1809038)
Show SMILES OCCn1cc2C[C@H]3N(C[C@@H](C=C3c3cccc1c23)C(=O)N1CCCC1)C(=O)Nc1ccccc1 |r,c:11|
Show InChI InChI=1S/C28H30N4O3/c33-14-13-31-17-19-16-25-23(22-9-6-10-24(31)26(19)22)15-20(27(34)30-11-4-5-12-30)18-32(25)28(35)29-21-7-2-1-3-8-21/h1-3,6-10,15,17,20,25,33H,4-5,11-14,16,18H2,(H,29,35)/t20-,25-/m1/s1
n/an/a 6n/an/an/an/an/an/a
Novartis Institutes for BioMedical Research
Curated by ChEMBL
Assay Description
Displacement of radiolabeled CXCL11 from human CXCR3 expressed in CHO cells by scintillation proximity assay
Bioorg Med Chem Lett 21: 4745-9 (2011)
Article DOI: 10.1016/j.bmcl.2011.06.070
BindingDB Entry DOI: 10.7270/Q2VM4CN5
C-X-C chemokine receptor type 3
(Rattus norvegicus)
BDBM50349672
(CHEMBL1809038)
Show SMILES OCCn1cc2C[C@H]3N(C[C@@H](C=C3c3cccc1c23)C(=O)N1CCCC1)C(=O)Nc1ccccc1 |r,c:11|
Show InChI InChI=1S/C28H30N4O3/c33-14-13-31-17-19-16-25-23(22-9-6-10-24(31)26(19)22)15-20(27(34)30-11-4-5-12-30)18-32(25)28(35)29-21-7-2-1-3-8-21/h1-3,6-10,15,17,20,25,33H,4-5,11-14,16,18H2,(H,29,35)/t20-,25-/m1/s1
Reactome pathway
n/an/a 7n/an/an/an/an/an/a
Novartis Institutes for BioMedical Research
Curated by ChEMBL
Assay Description
Ex vivo receptor occupancy of CXCR3 in rat blood assessed as inhibition of ITAC binding after 1 hr by flow cytometry
Bioorg Med Chem Lett 21: 4745-9 (2011)
Article DOI: 10.1016/j.bmcl.2011.06.070
BindingDB Entry DOI: 10.7270/Q2VM4CN5
C-X-C chemokine receptor type 3
(Mus musculus)
BDBM50349672
(CHEMBL1809038)
Show SMILES OCCn1cc2C[C@H]3N(C[C@@H](C=C3c3cccc1c23)C(=O)N1CCCC1)C(=O)Nc1ccccc1 |r,c:11|
Show InChI InChI=1S/C28H30N4O3/c33-14-13-31-17-19-16-25-23(22-9-6-10-24(31)26(19)22)15-20(27(34)30-11-4-5-12-30)18-32(25)28(35)29-21-7-2-1-3-8-21/h1-3,6-10,15,17,20,25,33H,4-5,11-14,16,18H2,(H,29,35)/t20-,25-/m1/s1
Reactome pathway
n/an/a 4n/an/an/an/an/an/a
Novartis Institutes for BioMedical Research
Curated by ChEMBL
Assay Description
Antagonist activity at mouse CXCR3 expressed in mouse L1.2 cells assessed as inhibition of ITAC-induced calcium mobilization by FLIPR assay
Bioorg Med Chem Lett 21: 4745-9 (2011)
Article DOI: 10.1016/j.bmcl.2011.06.070
BindingDB Entry DOI: 10.7270/Q2VM4CN5
chemokine (C-X-C motif) receptor 3
(Homo sapiens (Human))
BDBM50349672
(CHEMBL1809038)
Show SMILES OCCn1cc2C[C@H]3N(C[C@@H](C=C3c3cccc1c23)C(=O)N1CCCC1)C(=O)Nc1ccccc1 |r,c:11|
Show InChI InChI=1S/C28H30N4O3/c33-14-13-31-17-19-16-25-23(22-9-6-10-24(31)26(19)22)15-20(27(34)30-11-4-5-12-30)18-32(25)28(35)29-21-7-2-1-3-8-21/h1-3,6-10,15,17,20,25,33H,4-5,11-14,16,18H2,(H,29,35)/t20-,25-/m1/s1
n/an/a 5n/an/an/an/an/an/a
Novartis Institutes for BioMedical Research
Curated by ChEMBL
Assay Description
Antagonist activity at human CXCR3 expressed in mouse L1.2 cells assessed as inhibition of ITAC-induced calcium mobilization by FLIPR assay
Bioorg Med Chem Lett 21: 4745-9 (2011)
Article DOI: 10.1016/j.bmcl.2011.06.070
BindingDB Entry DOI: 10.7270/Q2VM4CN5