BDBM50349813 CHEMBL1813011
SMILES: CCO[C@@H](Cc1ccc(OCCc2nc(oc2C)-c2ccc(C)s2)cc1)C(O)=O
InChI Key: InChIKey=KACYCSASEXQENA-IBGZPJMESA-N
Data: 2 EC50
Activity Spreadsheet -- Enzyme Inhibition Constant Data from BindingDB
Found 2 hits for monomerid = 50349813
Trg + Lig
Ki
nM
ΔG°
kcal/mole
IC50
nM
Kd
nM
EC50/IC50
nM
koff
s-1
kon
M-1s-1
pHTemp
°C
Peroxisome proliferator-activated receptor alpha (PPAR alpha)
(Homo sapiens (Human))
BDBM50349813
(CHEMBL1813011)
Show SMILES CCO[C@@H](Cc1ccc(OCCc2nc(oc2C)-c2ccc(C)s2)cc1)C(O)=O |r|
Show InChI InChI=1S/C22H25NO5S/c1-4-26-19(22(24)25)13-16-6-8-17(9-7-16)27-12-11-18-15(3)28-21(23-18)20-10-5-14(2)29-20/h5-10,19H,4,11-13H2,1-3H3,(H,24,25)/t19-/m0/s1
n/an/an/an/a 0.000310n/an/an/an/a
Zydus Research Centre
Curated by ChEMBL
Assay Description
Transactivation of human PPARalpha expressed in human HepG2 cells cotransfected with PPRE3-TK-Luc by luciferase reporter gene assay
Bioorg Med Chem Lett 21: 3103-9 (2011)
Article DOI: 10.1016/j.bmcl.2011.03.020
BindingDB Entry DOI: 10.7270/Q2ZC837H
Peroxisome proliferator-activated receptor
(Homo sapiens (Human))
BDBM50349813
(CHEMBL1813011)
Show SMILES CCO[C@@H](Cc1ccc(OCCc2nc(oc2C)-c2ccc(C)s2)cc1)C(O)=O |r|
Show InChI InChI=1S/C22H25NO5S/c1-4-26-19(22(24)25)13-16-6-8-17(9-7-16)27-12-11-18-15(3)28-21(23-18)20-10-5-14(2)29-20/h5-10,19H,4,11-13H2,1-3H3,(H,24,25)/t19-/m0/s1
NCI pathway
Reactome pathway
n/an/an/an/a 0.0180n/an/an/an/a
Zydus Research Centre
Curated by ChEMBL
Assay Description
Transactivation of human PPARgamma expressed in human HepG2 cells cotransfected with PPRE3-TK-Luc by luciferase reporter gene assay
Bioorg Med Chem Lett 21: 3103-9 (2011)
Article DOI: 10.1016/j.bmcl.2011.03.020
BindingDB Entry DOI: 10.7270/Q2ZC837H