BDBM50349990 CHEMBL1813015
SMILES: CC(=O)Nc1cccc(Nc2ncnc(n2)N2CCc3ccccc3C2)c1
InChI Key: InChIKey=ZNZCGEXKQOUCKF-UHFFFAOYSA-N
Data: 4 IC50
Activity Spreadsheet -- Enzyme Inhibition Constant Data from BindingDB
Found 4 hits for monomerid = 50349990
Trg + Lig
Ki
nM
ΔG°
kcal/mole
IC50
nM
Kd
nM
EC50/IC50
nM
koff
s-1
kon
M-1s-1
pHTemp
°C
Sodium channel protein type 9 subunit alpha
(Homo sapiens (Human))
BDBM50349990
(CHEMBL1813015)
Show SMILES CC(=O)Nc1cccc(Nc2ncnc(n2)N2CCc3ccccc3C2)c1
Show InChI InChI=1S/C20H20N6O/c1-14(27)23-17-7-4-8-18(11-17)24-19-21-13-22-20(25-19)26-10-9-15-5-2-3-6-16(15)12-26/h2-8,11,13H,9-10,12H2,1H3,(H,23,27)(H,21,22,24,25)
n/an/a 1.90E+3n/an/an/an/an/an/a
Amgen Inc.
Curated by ChEMBL
Assay Description
Inhibition of human sodium channel Nav1.7 expressed in human HEK293 cells by patch-clamp electrophysiological assay
J Med Chem 54: 4427-45 (2011)
Article DOI: 10.1021/jm200018k
BindingDB Entry DOI: 10.7270/Q2N016W1
Sodium channel protein type 5 subunit alpha
(Homo sapiens (Human))
BDBM50349990
(CHEMBL1813015)
Show SMILES CC(=O)Nc1cccc(Nc2ncnc(n2)N2CCc3ccccc3C2)c1
Show InChI InChI=1S/C20H20N6O/c1-14(27)23-17-7-4-8-18(11-17)24-19-21-13-22-20(25-19)26-10-9-15-5-2-3-6-16(15)12-26/h2-8,11,13H,9-10,12H2,1H3,(H,23,27)(H,21,22,24,25)
n/an/a 5.40E+3n/an/an/an/an/an/a
Amgen Inc.
Curated by ChEMBL
Assay Description
Inhibition of human cardiac sodium channel Nav1.5 expressed in human HEK293 cells by patch-clamp electrophysiological assay
J Med Chem 54: 4427-45 (2011)
Article DOI: 10.1021/jm200018k
BindingDB Entry DOI: 10.7270/Q2N016W1
Potassium voltage-gated channel subfamily H member 2
(Homo sapiens (Human))
BDBM50349990
(CHEMBL1813015)
Show SMILES CC(=O)Nc1cccc(Nc2ncnc(n2)N2CCc3ccccc3C2)c1
Show InChI InChI=1S/C20H20N6O/c1-14(27)23-17-7-4-8-18(11-17)24-19-21-13-22-20(25-19)26-10-9-15-5-2-3-6-16(15)12-26/h2-8,11,13H,9-10,12H2,1H3,(H,23,27)(H,21,22,24,25)
Reactome pathway
n/an/a 3.80E+3n/an/an/an/an/an/a
Amgen Inc.
Curated by ChEMBL
Assay Description
Inhibition of human Erg expressed in human HEK293 cells by patch-clamp electrophysiological assay
J Med Chem 54: 4427-45 (2011)
Article DOI: 10.1021/jm200018k
BindingDB Entry DOI: 10.7270/Q2N016W1
Sodium channel protein type 9 subunit alpha
(Homo sapiens (Human))
BDBM50349990
(CHEMBL1813015)
Show SMILES CC(=O)Nc1cccc(Nc2ncnc(n2)N2CCc3ccccc3C2)c1
Show InChI InChI=1S/C20H20N6O/c1-14(27)23-17-7-4-8-18(11-17)24-19-21-13-22-20(25-19)26-10-9-15-5-2-3-6-16(15)12-26/h2-8,11,13H,9-10,12H2,1H3,(H,23,27)(H,21,22,24,25)
n/an/a 900n/an/an/an/an/an/a
Amgen Inc.
Curated by ChEMBL
Assay Description
Inhibition of 30% inactivated human sodium channel Nav1.7 expressed in human HEK293 cells by patch-clamp electrophysiological assay
J Med Chem 54: 4427-45 (2011)
Article DOI: 10.1021/jm200018k
BindingDB Entry DOI: 10.7270/Q2N016W1