BDBM50349996 CHEMBL1813040
SMILES: CC(=O)Nc1cccc(Nc2ncnc(n2)N2CCC(CC2)OCc2ccccc2C(F)(F)F)c1C
InChI Key: InChIKey=DFELGVBLUUDTHP-UHFFFAOYSA-N
Data: 1 IC50
Activity Spreadsheet -- Enzyme Inhibition Constant Data from BindingDB
Found 1 hit for monomerid = 50349996
Trg + Lig
Ki
nM
ΔG°
kcal/mole
IC50
nM
Kd
nM
EC50/IC50
nM
koff
s-1
kon
M-1s-1
pHTemp
°C
Sodium channel protein type 9 subunit alpha
(Homo sapiens (Human))
BDBM50349996
(CHEMBL1813040)
Show SMILES CC(=O)Nc1cccc(Nc2ncnc(n2)N2CCC(CC2)OCc2ccccc2C(F)(F)F)c1C
Show InChI InChI=1S/C25H27F3N6O2/c1-16-21(31-17(2)35)8-5-9-22(16)32-23-29-15-30-24(33-23)34-12-10-19(11-13-34)36-14-18-6-3-4-7-20(18)25(26,27)28/h3-9,15,19H,10-14H2,1-2H3,(H,31,35)(H,29,30,32,33)
n/an/a 8.10E+3n/an/an/an/an/an/a
Amgen Inc.
Curated by ChEMBL
Assay Description
Inhibition of human sodium channel Nav1.7 expressed in human HEK293 cells by patch-clamp electrophysiological assay
J Med Chem 54: 4427-45 (2011)
Article DOI: 10.1021/jm200018k
BindingDB Entry DOI: 10.7270/Q2N016W1