BDBM50349997 CHEMBL1813039
SMILES: CC(=O)Nc1cccc(Nc2ncnc(n2)N2CCC(CC2)OCc2ccc(F)cc2)c1C
InChI Key: InChIKey=CCCFKQQTGDHLLP-UHFFFAOYSA-N
Data: 1 IC50
Activity Spreadsheet -- Enzyme Inhibition Constant Data from BindingDB
Found 1 hit for monomerid = 50349997
Trg + Lig
Ki
nM
ΔG°
kcal/mole
IC50
nM
Kd
nM
EC50/IC50
nM
koff
s-1
kon
M-1s-1
pHTemp
°C
Sodium channel protein type 9 subunit alpha
(Homo sapiens (Human))
BDBM50349997
(CHEMBL1813039)
Show SMILES CC(=O)Nc1cccc(Nc2ncnc(n2)N2CCC(CC2)OCc2ccc(F)cc2)c1C
Show InChI InChI=1S/C24H27FN6O2/c1-16-21(28-17(2)32)4-3-5-22(16)29-23-26-15-27-24(30-23)31-12-10-20(11-13-31)33-14-18-6-8-19(25)9-7-18/h3-9,15,20H,10-14H2,1-2H3,(H,28,32)(H,26,27,29,30)
n/an/a 2.60E+3n/an/an/an/an/an/a
Amgen Inc.
Curated by ChEMBL
Assay Description
Inhibition of human sodium channel Nav1.7 expressed in human HEK293 cells by patch-clamp electrophysiological assay
J Med Chem 54: 4427-45 (2011)
Article DOI: 10.1021/jm200018k
BindingDB Entry DOI: 10.7270/Q2N016W1