BDBM50350017 CHEMBL1813019
SMILES: CN(c1cccc(NC(C)=O)c1)c1ncnc(n1)N1CCc2ccccc2C1
InChI Key: InChIKey=FBQDSJPKEDIMBY-UHFFFAOYSA-N
Data: 1 IC50
Activity Spreadsheet -- Enzyme Inhibition Constant Data from BindingDB
Found 1 hit for monomerid = 50350017
Trg + Lig
Ki
nM
ΔG°
kcal/mole
IC50
nM
Kd
nM
EC50/IC50
nM
koff
s-1
kon
M-1s-1
pHTemp
°C
Sodium channel protein type 9 subunit alpha
(Homo sapiens (Human))
BDBM50350017
(CHEMBL1813019)
Show SMILES CN(c1cccc(NC(C)=O)c1)c1ncnc(n1)N1CCc2ccccc2C1
Show InChI InChI=1S/C21H22N6O/c1-15(28)24-18-8-5-9-19(12-18)26(2)20-22-14-23-21(25-20)27-11-10-16-6-3-4-7-17(16)13-27/h3-9,12,14H,10-11,13H2,1-2H3,(H,24,28)
n/an/a>1.00E+4n/an/an/an/an/an/a
Amgen Inc.
Curated by ChEMBL
Assay Description
Inhibition of human sodium channel Nav1.7 expressed in human HEK293 cells by patch-clamp electrophysiological assay
J Med Chem 54: 4427-45 (2011)
Article DOI: 10.1021/jm200018k
BindingDB Entry DOI: 10.7270/Q2N016W1