BDBM50350082 CHEMBL1813649
SMILES: CSc1nc(Oc2ccc(NC(=O)c3cccn(-c4ccc(F)cc4)c3=O)cc2F)c2c(coc2n1)-c1ccccc1
InChI Key: InChIKey=GMRQSICJBGWEQQ-UHFFFAOYSA-N
Data: 1 IC50
Activity Spreadsheet -- Enzyme Inhibition Constant Data from BindingDB
Found 1 hit for monomerid = 50350082
Trg + Lig
Ki
nM
ΔG°
kcal/mole
IC50
nM
Kd
nM
EC50/IC50
nM
koff
s-1
kon
M-1s-1
pHTemp
°C
Hepatocyte growth factor receptor
(Homo sapiens (Human))
BDBM50350082
(CHEMBL1813649)
Show SMILES CSc1nc(Oc2ccc(NC(=O)c3cccn(-c4ccc(F)cc4)c3=O)cc2F)c2c(coc2n1)-c1ccccc1
Show InChI InChI=1S/C31H20F2N4O4S/c1-42-31-35-28-26(23(17-40-28)18-6-3-2-4-7-18)29(36-31)41-25-14-11-20(16-24(25)33)34-27(38)22-8-5-15-37(30(22)39)21-12-9-19(32)10-13-21/h2-17H,1H3,(H,34,38)
n/an/a>1.00E+4n/an/an/an/an/an/a
Chinese Academy of Sciences
Curated by ChEMBL
Assay Description
Inhibition of c-Met after 60 mins by ELISA
Bioorg Med Chem 19: 3906-18 (2011)
Article DOI: 10.1016/j.bmc.2011.05.038
BindingDB Entry DOI: 10.7270/Q2CF9QGW