BDBM50350116 CHEMBL1814072
SMILES: O=C(NC1CCCCC1)c1coc2ccccc2c1=O
InChI Key: InChIKey=MSXWVKUAVJKWRK-UHFFFAOYSA-N
Data: 1 IC50
Activity Spreadsheet -- Enzyme Inhibition Constant Data from BindingDB
Found 1 hit for monomerid = 50350116
Trg + Lig
Ki
nM
ΔG°
kcal/mole
IC50
nM
Kd
nM
EC50/IC50
nM
koff
s-1
kon
M-1s-1
pHTemp
°C
Amine oxidase [flavin-containing] B
(Homo sapiens (Human))
BDBM50350116
(CHEMBL1814072)
Show SMILES O=C(NC1CCCCC1)c1coc2ccccc2c1=O
Show InChI InChI=1S/C16H17NO3/c18-15-12-8-4-5-9-14(12)20-10-13(15)16(19)17-11-6-2-1-3-7-11/h4-5,8-11H,1-3,6-7H2,(H,17,19)
n/an/a 930n/an/an/an/an/an/a
Universidade do Porto
Curated by ChEMBL
Assay Description
Inhibition of human MAO-B assessed as inhibition of p-tyramine oxidation to p-hydroxyphenyl-acetaldehyde after 15 mins by fluorimetric method
J Med Chem 54: 5165-73 (2011)
Article DOI: 10.1021/jm2004267
BindingDB Entry DOI: 10.7270/Q20865PP