BDBM50350117 CHEMBL1814069
SMILES: FC(F)(F)Oc1ccc(NC(=O)c2coc3ccccc3c2=O)cc1
InChI Key: InChIKey=SBNRGWHWDAJKGL-UHFFFAOYSA-N
Data: 1 IC50
Activity Spreadsheet -- Enzyme Inhibition Constant Data from BindingDB
Found 1 hit for monomerid = 50350117
Trg + Lig
Ki
nM
ΔG°
kcal/mole
IC50
nM
Kd
nM
EC50/IC50
nM
koff
s-1
kon
M-1s-1
pHTemp
°C
Amine oxidase [flavin-containing] B
(Homo sapiens (Human))
BDBM50350117
(CHEMBL1814069)
Show SMILES FC(F)(F)Oc1ccc(NC(=O)c2coc3ccccc3c2=O)cc1
Show InChI InChI=1S/C17H10F3NO4/c18-17(19,20)25-11-7-5-10(6-8-11)21-16(23)13-9-24-14-4-2-1-3-12(14)15(13)22/h1-9H,(H,21,23)
n/an/a 1.08E+3n/an/an/an/an/an/a
Universidade do Porto
Curated by ChEMBL
Assay Description
Inhibition of human MAO-B assessed as inhibition of p-tyramine oxidation to p-hydroxyphenyl-acetaldehyde after 15 mins by fluorimetric method
J Med Chem 54: 5165-73 (2011)
Article DOI: 10.1021/jm2004267
BindingDB Entry DOI: 10.7270/Q20865PP