BDBM50350194 CHEMBL1814762
SMILES: Nc1ncnc2n(cc(-c3ccccc3)c12)[C@@H]1O[C@H](CO)[C@@H](O)[C@H]1O
InChI Key: InChIKey=SAFLKKGMJZQGAJ-LSCFUAHRSA-N
Data: 2 IC50
Activity Spreadsheet -- Enzyme Inhibition Constant Data from BindingDB
Found 2 hits for monomerid = 50350194
Trg + Lig
Ki
nM
ΔG°
kcal/mole
IC50
nM
Kd
nM
EC50/IC50
nM
koff
s-1
kon
M-1s-1
pHTemp
°C
Adenosine kinase
(Homo sapiens (Human))
BDBM50350194
(CHEMBL1814762)
Show SMILES Nc1ncnc2n(cc(-c3ccccc3)c12)[C@@H]1O[C@H](CO)[C@@H](O)[C@H]1O |r|
Show InChI InChI=1S/C17H18N4O4/c18-15-12-10(9-4-2-1-3-5-9)6-21(16(12)20-8-19-15)17-14(24)13(23)11(7-22)25-17/h1-6,8,11,13-14,17,22-24H,7H2,(H2,18,19,20)/t11-,13-,14-,17-/m1/s1
Reactome pathway
n/an/a>5.00E+3n/an/an/an/an/an/a
Academy of Sciences of the Czech Republic
Curated by ChEMBL
Assay Description
Inhibition of human ADK using [3H]-adenosine by scintillation counting
J Med Chem 54: 5498-507 (2011)
Article DOI: 10.1021/jm2005173
BindingDB Entry DOI: 10.7270/Q2BK1CQX
Adenosine kinase
(Homo sapiens (Human))
BDBM50350194
(CHEMBL1814762)
Show SMILES Nc1ncnc2n(cc(-c3ccccc3)c12)[C@@H]1O[C@H](CO)[C@@H](O)[C@H]1O |r|
Show InChI InChI=1S/C17H18N4O4/c18-15-12-10(9-4-2-1-3-5-9)6-21(16(12)20-8-19-15)17-14(24)13(23)11(7-22)25-17/h1-6,8,11,13-14,17,22-24H,7H2,(H2,18,19,20)/t11-,13-,14-,17-/m1/s1
Reactome pathway
n/an/a>5.00E+3n/an/an/an/an/an/a
Academy of Sciences of the Czech Republic
Curated by ChEMBL
Assay Description
Inhibition of human ADK expressed in Escherichia coli BL21(DE3) cells using [3H]adenosine by liquid scintillation counting method
J Med Chem 57: 8268-79 (2014)
Article DOI: 10.1021/jm500497v
BindingDB Entry DOI: 10.7270/Q29888MK