BDBM50350195 CHEMBL1814763
SMILES: COc1ccc(cc1)-c1cn([C@@H]2O[C@H](CO)[C@@H](O)[C@H]2O)c2ncnc(N)c12
InChI Key: InChIKey=FRHOOCXQYQVLGW-SCFUHWHPSA-N
Data: 2 IC50
Activity Spreadsheet -- Enzyme Inhibition Constant Data from BindingDB
Found 2 hits for monomerid = 50350195
Trg + Lig
Ki
nM
ΔG°
kcal/mole
IC50
nM
Kd
nM
EC50/IC50
nM
koff
s-1
kon
M-1s-1
pHTemp
°C
Adenosine kinase
(Homo sapiens (Human))
BDBM50350195
(CHEMBL1814763)
Show SMILES COc1ccc(cc1)-c1cn([C@@H]2O[C@H](CO)[C@@H](O)[C@H]2O)c2ncnc(N)c12 |r|
Show InChI InChI=1S/C18H20N4O5/c1-26-10-4-2-9(3-5-10)11-6-22(17-13(11)16(19)20-8-21-17)18-15(25)14(24)12(7-23)27-18/h2-6,8,12,14-15,18,23-25H,7H2,1H3,(H2,19,20,21)/t12-,14-,15-,18-/m1/s1
Reactome pathway
n/an/a>2.00E+3n/an/an/an/an/an/a
Academy of Sciences of the Czech Republic
Curated by ChEMBL
Assay Description
Inhibition of human ADK using [3H]-adenosine by scintillation counting
J Med Chem 54: 5498-507 (2011)
Article DOI: 10.1021/jm2005173
BindingDB Entry DOI: 10.7270/Q2BK1CQX
Adenosine kinase
(Homo sapiens (Human))
BDBM50350195
(CHEMBL1814763)
Show SMILES COc1ccc(cc1)-c1cn([C@@H]2O[C@H](CO)[C@@H](O)[C@H]2O)c2ncnc(N)c12 |r|
Show InChI InChI=1S/C18H20N4O5/c1-26-10-4-2-9(3-5-10)11-6-22(17-13(11)16(19)20-8-21-17)18-15(25)14(24)12(7-23)27-18/h2-6,8,12,14-15,18,23-25H,7H2,1H3,(H2,19,20,21)/t12-,14-,15-,18-/m1/s1
Reactome pathway
n/an/a>5.00E+3n/an/an/an/an/an/a
Academy of Sciences of the Czech Republic
Curated by ChEMBL
Assay Description
Inhibition of human ADK expressed in Escherichia coli BL21(DE3) cells using [3H]adenosine by liquid scintillation counting method
J Med Chem 57: 8268-79 (2014)
Article DOI: 10.1021/jm500497v
BindingDB Entry DOI: 10.7270/Q29888MK