BDBM50350199 CHEMBL1814767
SMILES: Nc1ncnc2n(cc(-c3ccco3)c12)[C@@H]1O[C@H](CO)[C@@H](O)[C@H]1O
InChI Key: InChIKey=LHLVHKTXINGVSH-SDBHATRESA-N
Data: 2 IC50
Activity Spreadsheet -- Enzyme Inhibition Constant Data from BindingDB
Found 2 hits for monomerid = 50350199
Trg + Lig
Ki
nM
ΔG°
kcal/mole
IC50
nM
Kd
nM
EC50/IC50
nM
koff
s-1
kon
M-1s-1
pHTemp
°C
Adenosine kinase
(Homo sapiens (Human))
BDBM50350199
(CHEMBL1814767)
Show SMILES Nc1ncnc2n(cc(-c3ccco3)c12)[C@@H]1O[C@H](CO)[C@@H](O)[C@H]1O |r|
Show InChI InChI=1S/C15H16N4O5/c16-13-10-7(8-2-1-3-23-8)4-19(14(10)18-6-17-13)15-12(22)11(21)9(5-20)24-15/h1-4,6,9,11-12,15,20-22H,5H2,(H2,16,17,18)/t9-,11-,12-,15-/m1/s1
Reactome pathway
n/an/a>2.00E+3n/an/an/an/an/an/a
Academy of Sciences of the Czech Republic
Curated by ChEMBL
Assay Description
Inhibition of human ADK using [3H]-adenosine by scintillation counting
J Med Chem 54: 5498-507 (2011)
Article DOI: 10.1021/jm2005173
BindingDB Entry DOI: 10.7270/Q2BK1CQX
Adenosine kinase
(Homo sapiens (Human))
BDBM50350199
(CHEMBL1814767)
Show SMILES Nc1ncnc2n(cc(-c3ccco3)c12)[C@@H]1O[C@H](CO)[C@@H](O)[C@H]1O |r|
Show InChI InChI=1S/C15H16N4O5/c16-13-10-7(8-2-1-3-23-8)4-19(14(10)18-6-17-13)15-12(22)11(21)9(5-20)24-15/h1-4,6,9,11-12,15,20-22H,5H2,(H2,16,17,18)/t9-,11-,12-,15-/m1/s1
Reactome pathway
n/an/a>5.00E+3n/an/an/an/an/an/a
Academy of Sciences of the Czech Republic
Curated by ChEMBL
Assay Description
Inhibition of human ADK expressed in Escherichia coli BL21(DE3) cells using [3H]adenosine by liquid scintillation counting method
J Med Chem 57: 8268-79 (2014)
Article DOI: 10.1021/jm500497v
BindingDB Entry DOI: 10.7270/Q29888MK