BDBM50350203 CHEMBL1814771
SMILES: Nc1ncnc2n(cc(-c3cc4ccccc4o3)c12)[C@@H]1O[C@H](CO)[C@@H](O)[C@H]1O
InChI Key: InChIKey=CUWOUDNQUDFGPI-NVQRDWNXSA-N
Data: 2 IC50
Activity Spreadsheet -- Enzyme Inhibition Constant Data from BindingDB
Found 2 hits for monomerid = 50350203
Trg + Lig
Ki
nM
ΔG°
kcal/mole
IC50
nM
Kd
nM
EC50/IC50
nM
koff
s-1
kon
M-1s-1
pHTemp
°C
Adenosine kinase
(Homo sapiens (Human))
BDBM50350203
(CHEMBL1814771)
Show SMILES Nc1ncnc2n(cc(-c3cc4ccccc4o3)c12)[C@@H]1O[C@H](CO)[C@@H](O)[C@H]1O |r|
Show InChI InChI=1S/C19H18N4O5/c20-17-14-10(12-5-9-3-1-2-4-11(9)27-12)6-23(18(14)22-8-21-17)19-16(26)15(25)13(7-24)28-19/h1-6,8,13,15-16,19,24-26H,7H2,(H2,20,21,22)/t13-,15-,16-,19-/m1/s1
Reactome pathway
n/an/a>1.00E+4n/an/an/an/an/an/a
Academy of Sciences of the Czech Republic
Curated by ChEMBL
Assay Description
Inhibition of human ADK using [3H]-adenosine by scintillation counting
J Med Chem 54: 5498-507 (2011)
Article DOI: 10.1021/jm2005173
BindingDB Entry DOI: 10.7270/Q2BK1CQX
Adenosine kinase
(Homo sapiens (Human))
BDBM50350203
(CHEMBL1814771)
Show SMILES Nc1ncnc2n(cc(-c3cc4ccccc4o3)c12)[C@@H]1O[C@H](CO)[C@@H](O)[C@H]1O |r|
Show InChI InChI=1S/C19H18N4O5/c20-17-14-10(12-5-9-3-1-2-4-11(9)27-12)6-23(18(14)22-8-21-17)19-16(26)15(25)13(7-24)28-19/h1-6,8,13,15-16,19,24-26H,7H2,(H2,20,21,22)/t13-,15-,16-,19-/m1/s1
Reactome pathway
n/an/a>1.00E+4n/an/an/an/an/an/a
Academy of Sciences of the Czech Republic
Curated by ChEMBL
Assay Description
Inhibition of human ADK expressed in Escherichia coli BL21(DE3) cells using [3H]adenosine by liquid scintillation counting method
J Med Chem 57: 8268-79 (2014)
Article DOI: 10.1021/jm500497v
BindingDB Entry DOI: 10.7270/Q29888MK