BDBM50350249 CHEMBL1812547
SMILES: OC(=O)\C=C\c1c[nH]c2cc(F)ccc12
InChI Key: InChIKey=ZJQAEZVFMQFBPD-DAFODLJHSA-N
Data: 1 KI  1 IC50
Activity Spreadsheet -- Enzyme Inhibition Constant Data from BindingDB
Found 2 hits for monomerid = 50350249
Trg + Lig
Ki
nM
ΔG°
kcal/mole
IC50
nM
Kd
nM
EC50/IC50
nM
koff
s-1
kon
M-1s-1
pHTemp
°C
Tryptophan 2,3-dioxygenase
(Homo sapiens (Human))
BDBM50350249
(CHEMBL1812547)
Show SMILES OC(=O)\C=C\c1c[nH]c2cc(F)ccc12
Show InChI InChI=1S/C11H8FNO2/c12-8-2-3-9-7(1-4-11(14)15)6-13-10(9)5-8/h1-6,13H,(H,14,15)/b4-1+
Reactome pathway
3.24E+4n/an/an/an/an/an/an/an/a
University of Namur
Curated by ChEMBL
Assay Description
Competitive inhibition of human recombinant TDO expressed in Escherichia coli BL21 using L-tryptophan as substrate by measuring conversion of N-formy...
J Med Chem 54: 5320-34 (2011)
Article DOI: 10.1021/jm2006782
BindingDB Entry DOI: 10.7270/Q2RF5W11
Tryptophan 2,3-dioxygenase
(Mus musculus)
BDBM50350249
(CHEMBL1812547)
Show SMILES OC(=O)\C=C\c1c[nH]c2cc(F)ccc12
Show InChI InChI=1S/C11H8FNO2/c12-8-2-3-9-7(1-4-11(14)15)6-13-10(9)5-8/h1-6,13H,(H,14,15)/b4-1+
Reactome pathway
n/an/a 3.00E+3n/an/an/an/an/an/a
University of Namur
Curated by ChEMBL
Assay Description
Inhibition of mouse TDO expressed in mouse P815B cells assessed as inhibition of tryptophan catabolism by measuring kynurenine production after 8 hrs...
J Med Chem 54: 5320-34 (2011)
Article DOI: 10.1021/jm2006782
BindingDB Entry DOI: 10.7270/Q2RF5W11