null
SMILES: Oc1c2CN(CCn2c(=O)n1[C@H]1C[C@@H]1c1ccccc1)C(=O)Nc1cccnc1-c1cccc(c1)C#N
InChI Key: InChIKey=OKVVKQCXOMYYQE-GGAORHGYSA-N
Activity Spreadsheet -- Enzyme Inhibition Constant Data from BindingDB
Found 3 hits for monomerid = 50350335
Trg + Lig
Ki
nM
ΔG°
kcal/mole
IC50
nM
Kd
nM
EC50/IC50
nM
koff
s-1
kon
M-1s-1
pHTemp
°C
Smoothened homolog
(Homo sapiens (Human))
BDBM50350335
(CHEMBL1813107)
Show SMILES Oc1c2CN(CCn2c(=O)n1[C@H]1C[C@@H]1c1ccccc1)C(=O)Nc1cccnc1-c1cccc(c1)C#N |r|
Show InChI InChI=1S/C28H24N6O3/c29-16-18-6-4-9-20(14-18)25-22(10-5-11-30-25)31-27(36)32-12-13-33-24(17-32)26(35)34(28(33)37)23-15-21(23)19-7-2-1-3-8-19/h1-11,14,21,23,35H,12-13,15,17H2,(H,31,36)/t21-,23+/m1/s1
n/an/a 5n/an/an/an/an/an/a
Merck Research Laboratories Rome
Curated by ChEMBL
Assay Description
Antagonist activity at smoothened expressed in mouse Shh Light2 cells assessed as inhibition of purmorphamine- induced Gli-dependent luciferase gene ...
Bioorg Med Chem Lett 21: 4429-35 (2011)
Article DOI: 10.1016/j.bmcl.2011.06.023
BindingDB Entry DOI: 10.7270/Q2K074NQ
Smoothened homolog
(Homo sapiens (Human))
BDBM50350335
(CHEMBL1813107)
Show SMILES Oc1c2CN(CCn2c(=O)n1[C@H]1C[C@@H]1c1ccccc1)C(=O)Nc1cccnc1-c1cccc(c1)C#N |r|
Show InChI InChI=1S/C28H24N6O3/c29-16-18-6-4-9-20(14-18)25-22(10-5-11-30-25)31-27(36)32-12-13-33-24(17-32)26(35)34(28(33)37)23-15-21(23)19-7-2-1-3-8-19/h1-11,14,21,23,35H,12-13,15,17H2,(H,31,36)/t21-,23+/m1/s1
n/an/a 22n/an/an/an/an/an/a
Merck Research Laboratories Rome
Curated by ChEMBL
Assay Description
Displacement of BODIPY-cyclopamine from human Smo expressed in HEK293 cells in presence of 20% normal human serum
Bioorg Med Chem Lett 21: 4429-35 (2011)
Article DOI: 10.1016/j.bmcl.2011.06.023
BindingDB Entry DOI: 10.7270/Q2K074NQ
Smoothened homolog
(Homo sapiens (Human))
BDBM50350335
(CHEMBL1813107)
Show SMILES Oc1c2CN(CCn2c(=O)n1[C@H]1C[C@@H]1c1ccccc1)C(=O)Nc1cccnc1-c1cccc(c1)C#N |r|
Show InChI InChI=1S/C28H24N6O3/c29-16-18-6-4-9-20(14-18)25-22(10-5-11-30-25)31-27(36)32-12-13-33-24(17-32)26(35)34(28(33)37)23-15-21(23)19-7-2-1-3-8-19/h1-11,14,21,23,35H,12-13,15,17H2,(H,31,36)/t21-,23+/m1/s1
n/an/a 16n/an/an/an/an/an/a
Merck Research Laboratories Rome
Curated by ChEMBL
Assay Description
Displacement of BODIPY-cyclopamine from human Smo expressed in HEK293 cells in presence of 2% fetal calf serum
Bioorg Med Chem Lett 21: 4429-35 (2011)
Article DOI: 10.1016/j.bmcl.2011.06.023
BindingDB Entry DOI: 10.7270/Q2K074NQ