BDBM50350338 CHEMBL1813110
SMILES: Oc1c2CN(CCn2c(=O)n1[C@H]1C[C@@H]1c1ccccc1)C(=O)Nc1ccnn1-c1cccc(Cl)c1
InChI Key: InChIKey=AZAWFDKMUKHFPT-UXHICEINSA-N
Data: 3 IC50
Activity Spreadsheet -- Enzyme Inhibition Constant Data from BindingDB
Found 3 hits for monomerid = 50350338
Trg + Lig
Ki
nM
ΔG°
kcal/mole
IC50
nM
Kd
nM
EC50/IC50
nM
koff
s-1
kon
M-1s-1
pHTemp
°C
Smoothened homolog
(Homo sapiens (Human))
BDBM50350338
(CHEMBL1813110)
Show SMILES Oc1c2CN(CCn2c(=O)n1[C@H]1C[C@@H]1c1ccccc1)C(=O)Nc1ccnn1-c1cccc(Cl)c1 |r|
Show InChI InChI=1S/C25H23ClN6O3/c26-17-7-4-8-18(13-17)32-22(9-10-27-32)28-24(34)29-11-12-30-21(15-29)23(33)31(25(30)35)20-14-19(20)16-5-2-1-3-6-16/h1-10,13,19-20,33H,11-12,14-15H2,(H,28,34)/t19-,20+/m1/s1
n/an/a 8n/an/an/an/an/an/a
Merck Research Laboratories Rome
Curated by ChEMBL
Assay Description
Antagonist activity at smoothened expressed in mouse Shh Light2 cells assessed as inhibition of purmorphamine- induced Gli-dependent luciferase gene ...
Bioorg Med Chem Lett 21: 4429-35 (2011)
Article DOI: 10.1016/j.bmcl.2011.06.023
BindingDB Entry DOI: 10.7270/Q2K074NQ
Smoothened homolog
(Homo sapiens (Human))
BDBM50350338
(CHEMBL1813110)
Show SMILES Oc1c2CN(CCn2c(=O)n1[C@H]1C[C@@H]1c1ccccc1)C(=O)Nc1ccnn1-c1cccc(Cl)c1 |r|
Show InChI InChI=1S/C25H23ClN6O3/c26-17-7-4-8-18(13-17)32-22(9-10-27-32)28-24(34)29-11-12-30-21(15-29)23(33)31(25(30)35)20-14-19(20)16-5-2-1-3-6-16/h1-10,13,19-20,33H,11-12,14-15H2,(H,28,34)/t19-,20+/m1/s1
n/an/a 32n/an/an/an/an/an/a
Merck Research Laboratories Rome
Curated by ChEMBL
Assay Description
Displacement of BODIPY-cyclopamine from human Smo expressed in HEK293 cells in presence of 20% normal human serum
Bioorg Med Chem Lett 21: 4429-35 (2011)
Article DOI: 10.1016/j.bmcl.2011.06.023
BindingDB Entry DOI: 10.7270/Q2K074NQ
Smoothened homolog
(Homo sapiens (Human))
BDBM50350338
(CHEMBL1813110)
Show SMILES Oc1c2CN(CCn2c(=O)n1[C@H]1C[C@@H]1c1ccccc1)C(=O)Nc1ccnn1-c1cccc(Cl)c1 |r|
Show InChI InChI=1S/C25H23ClN6O3/c26-17-7-4-8-18(13-17)32-22(9-10-27-32)28-24(34)29-11-12-30-21(15-29)23(33)31(25(30)35)20-14-19(20)16-5-2-1-3-6-16/h1-10,13,19-20,33H,11-12,14-15H2,(H,28,34)/t19-,20+/m1/s1
n/an/a 18n/an/an/an/an/an/a
Merck Research Laboratories Rome
Curated by ChEMBL
Assay Description
Displacement of BODIPY-cyclopamine from human Smo expressed in HEK293 cells in presence of 2% fetal calf serum
Bioorg Med Chem Lett 21: 4429-35 (2011)
Article DOI: 10.1016/j.bmcl.2011.06.023
BindingDB Entry DOI: 10.7270/Q2K074NQ