BDBM50350357 CHEMBL1813280
SMILES: CN1C[C@@H](COc2ccc(C(=O)n3c(C)c(CC(O)=O)c4cc(F)ccc34)c(C)c2C)Oc2ccccc12
InChI Key: InChIKey=HWGMVBBAYYCZTO-NRFANRHFSA-N
Data: 1 KI  1 IC50
Activity Spreadsheet -- Enzyme Inhibition Constant Data from BindingDB
Found 2 hits for monomerid = 50350357
Trg + Lig
Ki
nM
ΔG°
kcal/mole
IC50
nM
Kd
nM
EC50/IC50
nM
koff
s-1
kon
M-1s-1
pHTemp
°C
Prostanoid IP receptor
(Homo sapiens (Human))
BDBM50350357
(CHEMBL1813280)
Show SMILES CN1C[C@@H](COc2ccc(C(=O)n3c(C)c(CC(O)=O)c4cc(F)ccc34)c(C)c2C)Oc2ccccc12 |r|
Show InChI InChI=1S/C30H29FN2O5/c1-17-18(2)27(37-16-21-15-32(4)26-7-5-6-8-28(26)38-21)12-10-22(17)30(36)33-19(3)23(14-29(34)35)24-13-20(31)9-11-25(24)33/h5-13,21H,14-16H2,1-4H3,(H,34,35)/t21-/m0/s1
NCI pathway
Reactome pathway
230n/an/an/an/an/an/an/an/a
Minase Research Institute
Curated by ChEMBL
Assay Description
Displacement of [3H]-Iloprost from human IP receptor expressed in CHO cells after 30 mins by liquid scintillation counting
Bioorg Med Chem 19: 4574-88 (2011)
Article DOI: 10.1016/j.bmc.2011.06.014
BindingDB Entry DOI: 10.7270/Q2FB5398
Prostanoid DP receptor
(Mus musculus)
BDBM50350357
(CHEMBL1813280)
Show SMILES CN1C[C@@H](COc2ccc(C(=O)n3c(C)c(CC(O)=O)c4cc(F)ccc34)c(C)c2C)Oc2ccccc12 |r|
Show InChI InChI=1S/C30H29FN2O5/c1-17-18(2)27(37-16-21-15-32(4)26-7-5-6-8-28(26)38-21)12-10-22(17)30(36)33-19(3)23(14-29(34)35)24-13-20(31)9-11-25(24)33/h5-13,21H,14-16H2,1-4H3,(H,34,35)/t21-/m0/s1
Reactome pathway
n/an/a 32n/an/an/an/an/an/a
Minase Research Institute
Curated by ChEMBL
Assay Description
Antagonist activity at mouse DP receptor expressed in CHO cells assessed as inhibition of PGD2-induced cAMP accumulation after 10 mins by enzyme immu...
Bioorg Med Chem 19: 4574-88 (2011)
Article DOI: 10.1016/j.bmc.2011.06.014
BindingDB Entry DOI: 10.7270/Q2FB5398