BDBM50350365 CHEMBL1813288
SMILES: CCN1C(COc2ccc(C(=O)n3c(C)c(CC(O)=O)c4ccccc34)c(C)c2)Cc2ccccc12
InChI Key: InChIKey=VAIYPASGHXDISO-UHFFFAOYSA-N
Data: 2 KI  1 IC50
Activity Spreadsheet -- Enzyme Inhibition Constant Data from BindingDB
Found 3 hits for monomerid = 50350365
Trg + Lig
Ki
nM
ΔG°
kcal/mole
IC50
nM
Kd
nM
EC50/IC50
nM
koff
s-1
kon
M-1s-1
pHTemp
°C
Prostanoid DP receptor
(Mus musculus)
BDBM50350365
(CHEMBL1813288)
Show SMILES CCN1C(COc2ccc(C(=O)n3c(C)c(CC(O)=O)c4ccccc34)c(C)c2)Cc2ccccc12
Show InChI InChI=1S/C30H30N2O4/c1-4-31-22(16-21-9-5-7-11-27(21)31)18-36-23-13-14-24(19(2)15-23)30(35)32-20(3)26(17-29(33)34)25-10-6-8-12-28(25)32/h5-15,22H,4,16-18H2,1-3H3,(H,33,34)
Reactome pathway
22n/an/an/an/an/an/an/an/a
Minase Research Institute
Curated by ChEMBL
Assay Description
Displacement of [3H]-PGD2 from mouse DP receptor expressed in CHO cells after 20 mins by liquid scintillation counting
Bioorg Med Chem 19: 4574-88 (2011)
Article DOI: 10.1016/j.bmc.2011.06.014
BindingDB Entry DOI: 10.7270/Q2FB5398
Prostanoid IP receptor
(Homo sapiens (Human))
BDBM50350365
(CHEMBL1813288)
Show SMILES CCN1C(COc2ccc(C(=O)n3c(C)c(CC(O)=O)c4ccccc34)c(C)c2)Cc2ccccc12
Show InChI InChI=1S/C30H30N2O4/c1-4-31-22(16-21-9-5-7-11-27(21)31)18-36-23-13-14-24(19(2)15-23)30(35)32-20(3)26(17-29(33)34)25-10-6-8-12-28(25)32/h5-15,22H,4,16-18H2,1-3H3,(H,33,34)
NCI pathway
Reactome pathway
5.10E+3n/an/an/an/an/an/an/an/a
Minase Research Institute
Curated by ChEMBL
Assay Description
Displacement of [3H]-Iloprost from human IP receptor expressed in CHO cells after 30 mins by liquid scintillation counting
Bioorg Med Chem 19: 4574-88 (2011)
Article DOI: 10.1016/j.bmc.2011.06.014
BindingDB Entry DOI: 10.7270/Q2FB5398
Prostanoid DP receptor
(Mus musculus)
BDBM50350365
(CHEMBL1813288)
Show SMILES CCN1C(COc2ccc(C(=O)n3c(C)c(CC(O)=O)c4ccccc34)c(C)c2)Cc2ccccc12
Show InChI InChI=1S/C30H30N2O4/c1-4-31-22(16-21-9-5-7-11-27(21)31)18-36-23-13-14-24(19(2)15-23)30(35)32-20(3)26(17-29(33)34)25-10-6-8-12-28(25)32/h5-15,22H,4,16-18H2,1-3H3,(H,33,34)
Reactome pathway
n/an/a 3.10n/an/an/an/an/an/a
Minase Research Institute
Curated by ChEMBL
Assay Description
Antagonist activity at mouse DP receptor expressed in CHO cells assessed as inhibition of PGD2-induced cAMP accumulation after 10 mins by enzyme immu...
Bioorg Med Chem 19: 4574-88 (2011)
Article DOI: 10.1016/j.bmc.2011.06.014
BindingDB Entry DOI: 10.7270/Q2FB5398